program: Orca
programVersion: 5.0.2
elementType: Cl Cl O O O N C C C C C C C C C C C C H H H H H H H H H
charge: 0
multiplicity: 1
keywords: wb97x-d3
keywords: def2-TZVPP
keywords: def2/J RIJCOSX
keywords: DEFGRID2
keywords: scfconv7
keywords: smallprint printgap noloewdin
keywords: NOSOSCF
formula: C12H9Cl2NO3
InChI: InChI=1/C12H9Cl2NO3/c1-3-12(2)10(16)15(11(17)18-12)9-5-7(13)4-8(14)6-9/h3-6H,1H2,2H3
27 atoms
Cl 3.396159 -1.289881 2.221091
Cl 3.148332 1.838386 -2.130149
O  -2.954867 -1.014667 -0.953475
O  -1.656675 0.537453 1.888383
O  -1.133919 -1.392662 -2.188512
N  -1.019306 -0.329507 -0.144741
C  -3.276395 -0.380543 0.305448
C  -1.913558 0.026553 0.83307
C  -3.932556 -1.396453 1.22112
C  -1.655806 -0.956676 -1.206253
C  0.379628 -0.134882 -0.083156
C  -4.179997 0.782813 0.010501
C  0.98923 0.672292 -1.030676
C  1.102324 -0.748275 0.927581
C  2.469999 -0.536675 0.97417
C  2.360413 0.847334 -0.95677
C  -3.878057 2.067227 0.12897
C  3.118398 0.253685 0.039696
H  -3.289726 -2.262157 1.382226
H  -4.144847 -0.938229 2.186082
H  -4.8750 -1.735562 0.791477
H  -5.165916 0.491763 -0.337661
H  0.404563 1.154211 -1.802559
H  0.611903 -1.387338 1.648864
H  -4.6137 2.8197 -0.122538
H  -2.92116 2.436026 0.474014
H  4.188205 0.403416 0.086604
elementType: Cl O N C H
totalener: -1663.64812096 hartree
nucrepener: 1523.21489798 hartree
electener: -3186.86301894 hartree
oneelecener: -5309.31281276 hartree
twoeener: 2122.44979382 hartree
cpcmener: -0.02622998 hartree
kineticenergy: 1659.31652308 hartree
xcener: -112.231956235882 hartree
chargesum: 0.0000000
charge: -0.068918 -0.068757 -0.272816 -0.403633 -0.404185 -0.054196 0.384518 0.229438 -0.278457 0.421460 0.113682 -0.271856 -0.207024 -0.215439 0.125852 0.125353 -0.185792 -0.128387 0.116729 0.111183 0.117241 0.142960 0.143949 0.147567 0.136180 0.113620 0.129726
qa: -0.0689 -0.0688 -0.2728 -0.4036 -0.4042 -0.0542 0.3845 0.2294 -0.2785 0.4215 0.1137 -0.2719 -0.2070 -0.2154 0.1259 0.1254 -0.1858 -0.1284 0.1167 0.1112 0.1172 0.1430 0.1439 0.1476 0.1362 0.1136 0.1297
va: 1.2335 1.2332 2.1578 2.1141 2.1124 3.1024 3.7049 4.2025 3.9434 4.4102 3.7054 3.9431 4.1251 4.1196 3.9050 3.9061 3.9333 4.0334 1.0037 1.0105 1.0031 1.0079 1.0206 1.0186 0.9993 1.0180 1.0163
dispcorr: -0.013698291 hartree
energy: -1663.661819254747
dipole: -27.55271 26.29823 -1.25448 0.32059 -0.01555 0.30504 3.90986 -3.20750 0.70235
magnitude: 1.46972 au
magnitude: 3.73572 debye
