program: Gaussian 09
title: 000065979
version: EM64L-G09RevD.01
frameworkgroup: C1[X(C12H15N3)]
method: RPBEPBE
basis: SDD
operation: Freq
keyword: #pfreq=noraman
keyword: PBEPBE/SDD
title: #p freq=noraman PBEPBE/SDD
converged: YES YES NO NO
title: Mulliken charges:
elementType: N N N C C C C C C C C C C C C H H H H H H H H H H H H H H H
charge: -0.454977 -0.445727 -0.151342 -0.546133 0.052659 -0.448551 -0.546554 0.341460 0.269374 -0.467309 -0.358789 -0.230187 0.254227 -0.394051 -0.457918 0.206988 0.228603 0.216680 0.224733 0.223082 0.223586 0.236319 0.308075 0.322513 0.218697 0.230048 0.217760 0.222581 0.226288 0.277866
chargesum: 0.00000
title: Mulliken charges with hydrogens summed into heavy atoms:
elementType: N N N C C C C C C C C C C C C
charge: -0.146902 -0.167861 -0.151342 -0.110542 0.052659 -0.007137 -0.099887 0.341460 0.269374 -0.230990 -0.036276 -0.011491 0.254227 0.053757 -0.009050
polarizability: 2.18453761e+02 2.80969212e+00 1.57093011e+02 -1.91620444e+00 2.19688778e+00 8.15344261e+01
1716.lowfreq: -7.0115 -0.0007 -0.0004 0.0001 3.7490 8.2143 48.8743 53.9218 98.8254
frequency: 48.8420 53.9177 98.8181 107.3565 140.5034 150.6832 211.2330 226.8551 240.1989 287.5562 312.3603 364.6807 428.0153 487.6879 497.8209 507.9098 557.8554 589.8298 619.3679 639.6883 712.5950 717.7321 734.1217 761.4435 791.6870 812.4271 834.7081 848.3392 888.1795 897.4007 911.3276 916.4221 938.8622 974.2095 991.6983 1020.6851 1032.3322 1042.4987 1058.7152 1073.1576 1086.6798 1128.5540 1157.5020 1172.0062 1175.8836 1189.9142 1206.1573 1211.2960 1222.0809 1244.3814 1274.0248 1280.5051 1291.9308 1301.9169 1316.7287 1320.4481 1389.2592 1407.9841 1446.0435 1460.9661 1465.1038 1469.0216 1478.3217 1478.8707 1501.3690 1539.6445 1607.8913 1616.5581 1634.2956 2948.6671 2967.1805 2971.8353 2992.0359 2992.7183 3010.8407 3035.8674 3043.2925 3056.5935 3076.0020 3123.9013 3146.3412 3166.5976 3534.7945 3560.0442
redmass: 3.8199 3.9477 1.9026 3.9937 2.5173 2.3281 5.0317 3.2157 2.5101 2.9223 5.1782 1.4748 3.8492 2.0603 1.8368 3.2716 3.1483 6.1353 2.7879 6.1071 3.3678 3.5226 4.0630 4.5169 1.3254 3.9772 1.3806 2.1351 1.7400 3.6056 1.5863 1.9786 3.4011 4.0485 1.2957 2.3832 3.3539 1.7174 2.1061 3.2678 1.8577 1.2122 1.6600 1.1474 1.5868 1.3372 1.1223 1.3396 1.7262 1.5050 1.4339 1.6173 1.4443 1.4879 1.5936 1.6606 2.7254 2.6601 2.4723 1.0980 1.1836 2.7974 1.0937 1.1113 1.1211 2.4385 6.7483 5.8064 5.7392 1.0594 1.0647 1.0656 1.0937 1.0647 1.0699 1.0979 1.0944 1.1048 1.1045 1.0867 1.0950 1.0965 1.0780 1.0755
irintensity: 1.9563 5.9484 2.4645 3.0694 1.2633 0.5658 0.6277 2.4279 1.4334 8.1799 2.7888 126.1475 3.0910 42.8510 68.4886 12.6616 16.0425 0.6891 3.2519 11.7096 1.4231 0.3031 12.7566 3.3067 65.2110 3.1960 2.8526 7.6997 1.3094 2.9708 2.2313 4.3999 3.9168 32.4590 4.8226 5.8670 6.4130 4.6523 15.0175 38.0443 12.7850 2.0281 0.5414 4.9594 1.8403 0.9469 2.1334 7.1002 16.6274 1.7979 56.9746 0.8642 0.2123 7.6370 29.9265 23.0654 7.4006 29.9199 103.5372 11.6531 22.7119 70.2797 4.8137 5.6467 6.0918 407.6947 231.3395 135.3355 253.6044 45.3454 80.3684 44.7381 26.3308 77.0578 55.3774 38.2063 38.4035 65.4211 55.0122 9.5056 23.2173 21.8013 5.4810 24.2986
temp: 298.150 k
press: 1.00000 atm
elementType: 7 7 7 6 6 6 6 6 6 6 6 6 6 6 6 1 1 1 1 1 1 1 1 1 1 1 1 1 1 1
symmnumber: 1
zpe: 659332.4 jmol-1
zpe.correction: 0.251126 hartree
zpe.thermalcorrener: 0.264239 hartree
zpe.thermalcorrenthalpy: 0.265183 hartree
zpe.thermalcorrgfe: 0.210978 hartree
zpe.sumelectzpe: -629.431745 hartree
zpe.sumelectthermal: -629.418632 hartree
zpe.sumelectthermalent: -629.417688 hartree
zpe.sumelectthermalfe: -629.471894 hartree
dipole: -0.7973 -3.9172 -1.1073
dipole: 4.1481
quadrupole: -73.5080 -82.9817 -92.2458
quadrupole: 4.0828 2.9661 1.8533
quadrupole: 9.4038 -0.0698 -9.3340 4.0828 2.9661 1.8533
hfenergy: -629.6828715 hartree
pointgroup: C01 [X(C12H15N3)]
dipole: 0.3468606 -1.5220586 0.4758056 debye
polarizability: 218.5513273|-1.5053119|156.8318048|-1.6773814|-4.1998009|81.698066 unknown
InChI: InChI=1S/C12H15N3/c1-3-9-4-2-6-11(10(9)5-1)15-12-13-7-8-14-12/h2,4,6,13,15H,1,3,5,7-8H2
charge 0 multiplicity 1
30 atoms
N  0.902446 -0.661233 -0.041395
N  3.195074 -1.344695 0.030764
N  2.736012 0.921196 -0.226272
C  -1.859571 -1.922346 0.055789
C  -1.519693 -0.436039 -0.012968
C  -3.377936 -1.951185 -0.311603
C  -3.925015 -0.548015 0.095582
C  -2.695471 0.348988 0.002875
C  -0.241738 0.179636 -0.055133
C  -2.625964 1.757042 -0.031006
C  -0.161732 1.598678 -0.105398
C  -1.348121 2.365203 -0.090131
C  2.244176 -0.293592 -0.073978
C  4.541853 -0.726589 0.135212
C  4.225423 0.776912 -0.220025
H  -1.2664 -2.552514 -0.63799
H  -1.692617 -2.318438 1.080026
H  -3.917073 -2.78138 0.177409
H  -3.480918 -2.078326 -1.405153
H  -4.311755 -0.562616 1.135185
H  -4.755059 -0.2131 -0.552544
H  -3.536193 2.366898 -0.019417
H  0.713505 -1.662533 -0.090833
H  0.824427 2.065802 -0.164221
H  -1.267728 3.457789 -0.130747
H  5.25274 -1.183409 -0.574844
H  4.952458 -0.827393 1.160405
H  4.673532 1.478331 0.506166
H  4.616426 1.036979 -1.221902
H  2.986016 -2.188548 0.568547
