program: Orca
programVersion: 5.0.2
elementType: H C C C C C C H H C H C C O C C C C C C H H H H F Cl Cl N
charge: 0
multiplicity: 1
keywords: wb97x-d3
keywords: def2-TZVPP
keywords: def2/J RIJCOSX
keywords: DEFGRID2
keywords: scfconv7
keywords: smallprint printgap noloewdin
keywords: NOSOSCF
formula: C15H8Cl2FNO
InChI: InChI=1/C15H8Cl2FNO/c16-9-7-12(17)15-13(8-9)19-6-5-14(15)20-11-3-1-10(18)2-4-11/h1-8H
28 atoms
H  -3.112497 0.224866 2.478844
C  -0.080335 2.826917 -0.019217
C  -0.053891 1.547211 0.45545
C  1.079086 0.723871 0.215024
C  1.016838 3.301509 -0.753585
C  2.123488 1.316986 -0.554481
C  1.281908 -0.606555 0.668609
H  1.00226 4.316991 -1.133488
H  4.059458 1.070444 -1.450516
C  2.421564 -1.299417 0.363698
H  2.554888 -2.311385 0.720351
C  3.42293 -0.689272 -0.407841
C  3.291147 0.587557 -0.862266
O  -1.104933 1.107798 1.192422
C  -2.147782 0.470098 0.577557
C  -4.311507 -0.853291 -0.478236
C  -2.208066 0.235054 -0.787932
C  -3.171447 0.04209 1.413648
C  -4.263224 -0.623276 0.88385
C  -3.303695 -0.43434 -1.31978
H  -1.420583 0.558253 -1.456247
H  -0.933901 3.465276 0.165217
H  -5.06412 -0.961308 1.528515
H  -3.358959 -0.624056 -2.383847
F  -5.368921 -1.503955 -0.992605
Cl 0.128414 -1.433865 1.654536
Cl 4.846615 -1.59708 -0.763005
N  2.06994 2.583208 -1.023146
elementType: H C O F Cl N
totalener: -1726.71814133 hartree
nucrepener: 1701.80954015 hartree
electener: -3428.52768147 hartree
oneelecener: -5751.70392809 hartree
twoeener: 2323.17624662 hartree
cpcmener: -0.01595614 hartree
kineticenergy: 1722.15096361 hartree
xcener: -118.629168568679 hartree
chargesum: -0.0000000
charge: 0.146825 -0.128649 0.176850 0.022215 0.058538 0.177257 0.001924 0.140579 0.122584 -0.126741 0.119542 0.126567 -0.216135 -0.308146 0.242003 0.256355 -0.166789 -0.227205 -0.139538 -0.192367 0.152079 0.152691 0.151565 0.151603 -0.226834 -0.057869 -0.071595 -0.337309
qa: 0.1468 -0.1286 0.1769 0.0222 0.0585 0.1773 0.0019 0.1406 0.1226 -0.1267 0.1195 0.1266 -0.2161 -0.3081 0.2420 0.2564 -0.1668 -0.2272 -0.1395 -0.1924 0.1521 0.1527 0.1516 0.1516 -0.2268 -0.0579 -0.0716 -0.3373
va: 1.0102 3.9225 3.9013 3.5175 4.0018 3.8783 3.8974 0.9920 1.0428 4.0716 1.0242 3.9075 4.1719 2.0767 3.6831 3.9267 3.8562 3.9547 3.8656 3.9080 1.0011 0.9999 0.9947 0.9969 1.0464 1.2583 1.2308 3.0901
dispcorr: -0.014083787 hartree
energy: -1726.732225111787
dipole: -7.85381 7.42361 -0.43020 10.84757 -10.11431 0.73326 -1.81172 1.94192 0.13020
magnitude: 0.86005 au
magnitude: 2.18608 debye
