program: Gaussian 09
title: 000065970
version: EM64L-G09RevD.01
frameworkgroup: C1[X(C15H11N9O)]
method: RPBEPBE
basis: SDD
operation: Freq
keyword: #p
keyword: freq=noraman
keyword: PBEPBE/SDD
title: #p freq=noraman PBEPBE/SDD
converged: YES YES NO NO
title: Mulliken charges:
elementType: O N N N N N N N N N C C C C C C C C C C C C C C C H H H H H H H H H H H
charge: -0.253252 -0.473018 -0.044196 -0.035223 -0.132014 -0.127607 -0.363745 -0.362999 -0.005286 -0.000162 0.508626 0.269405 0.403036 0.398424 0.126474 -0.457442 -0.341194 -0.354240 -0.346869 -0.350482 -0.367539 -0.379230 -0.363870 -0.052991 -0.045381 0.314127 0.222334 0.312892 0.221310 0.279297 0.262604 0.274988 0.265764 0.280072 0.356374 0.361014
chargesum: 0.00000
title: Mulliken charges with hydrogens summed into heavy atoms:
elementType: O N N N N N N N N N C C C C C C C C C C C C C C C
charge: -0.253252 -0.158891 -0.044196 -0.035223 -0.132014 -0.127607 -0.007371 -0.001985 -0.005286 -0.000162 0.508626 0.269405 0.403036 0.398424 0.126474 -0.235109 -0.028302 -0.132930 -0.067572 -0.087878 -0.092551 -0.113466 -0.083798 -0.052991 -0.045381
polarizability: 5.19824190e+02 -1.26499127e+00 2.09093993e+02 3.47905903e+00 -2.21130834e+00 9.32900392e+01
1716.lowfreq: -3.5723 -1.5737 -0.0006 0.0001 0.0009 4.9927 17.4664 25.3872 33.8364
frequency: 17.4419 25.3725 33.8291 53.4940 62.2327 68.2997 80.6060 94.3780 116.0923 133.4407 157.4283 182.7814 227.8070 257.2308 289.3144 328.2605 353.7255 392.8961 404.7931 410.9207 412.7983 448.9356 453.2557 487.1238 527.0329 536.2381 626.4369 628.4420 629.5446 634.6193 642.2023 656.0317 688.7386 715.8690 720.6609 721.0243 723.7188 730.9262 761.5339 776.1110 821.2791 837.3216 847.7744 867.2667 883.6402 886.3903 901.1024 906.6597 940.0396 942.0819 969.1440 976.5571 992.6400 993.7097 1006.4164 1007.2406 1009.5880 1011.8082 1066.0231 1076.4880 1092.8802 1109.4735 1113.3087 1118.0579 1121.4639 1155.3465 1157.4705 1191.7384 1195.8847 1204.0968 1206.0619 1245.7771 1263.0313 1311.6162 1315.1496 1367.5017 1370.8986 1402.7247 1404.3554 1417.1640 1424.8285 1440.1107 1442.8289 1498.4277 1535.6134 1544.9104 1564.3749 1587.6844 1607.0687 1625.6944 1630.8790 3114.6939 3122.6516 3156.0412 3160.3293 3161.9691 3162.9813 3174.5106 3201.4248 3528.7013 3606.0559 3608.1629
redmass: 8.4638 6.0666 7.2287 8.2780 7.2498 5.2137 6.8859 7.5432 6.3100 8.3173 7.4325 7.2084 6.1384 6.7921 9.8550 7.0338 8.4449 5.9537 2.9282 5.5067 3.4700 6.4094 5.8791 4.9833 3.9170 2.7091 7.0020 5.5596 6.9172 8.6766 2.7582 1.8125 4.3326 1.2644 5.1883 5.1518 1.4936 2.7693 4.8611 4.9227 4.9752 1.4372 1.6367 4.2067 1.4744 1.6005 5.7070 5.5833 12.8498 12.1507 1.3812 1.4006 9.3187 9.8416 1.6856 2.9823 1.3963 2.4330 6.6730 4.4330 2.9450 6.7725 5.8594 1.6606 1.6687 4.4303 4.9340 1.1628 1.2416 3.6020 3.0922 3.3033 2.0176 1.3211 1.4262 3.8279 3.8823 1.6704 1.9277 3.1255 3.7822 3.2802 3.8022 2.2924 4.3322 4.7559 7.3584 6.0572 4.4544 6.2308 6.4362 1.0898 1.0889 1.0887 1.0921 1.0952 1.0945 1.0973 1.0950 1.0758 1.0847 1.0845
irintensity: 0.3147 0.1659 0.1768 0.8955 0.2518 0.4536 2.5831 2.0642 6.4624 2.0983 1.4548 1.5737 5.7644 10.6562 1.1422 2.8118 12.4809 3.8813 0.1147 2.9446 1.0897 5.0801 0.1815 6.8522 2.0085 34.1534 10.6306 3.6791 0.9651 6.1009 6.4541 24.1892 27.1324 100.8589 11.9668 11.7851 63.4273 95.7096 15.9576 0.7114 6.9564 35.2265 13.8791 22.2926 39.2857 58.6839 1.0631 1.2742 15.8078 9.1489 0.0890 1.8964 27.3494 18.2500 6.9383 1.4734 0.7598 5.9257 12.1364 28.5844 25.0253 13.2719 8.3224 45.9484 7.5712 0.4415 0.5294 28.7670 5.3804 5.3111 18.9169 169.4860 41.4445 25.5967 74.8637 145.0657 5.5899 31.5684 20.0958 1.3553 43.1434 94.6194 445.8335 440.3179 49.4577 31.0793 31.4037 80.0385 77.2081 14.0778 79.2705 19.5205 19.6163 0.1665 2.2465 2.8485 1.6141 0.6200 5.0792 10.1005 166.9103 153.6463
temp: 298.150 k
press: 1.00000 atm
elementType: 8 7 7 7 7 7 7 7 7 7 6 6 6 6 6 6 6 6 6 6 6 6 6 6 6 1 1 1 1 1 1 1 1 1 1 1
symmnumber: 1
zpe: 674805.7 jmol-1
zpe.correction: 0.257020 hartree
zpe.thermalcorrener: 0.276572 hartree
zpe.thermalcorrenthalpy: 0.277516 hartree
zpe.thermalcorrgfe: 0.205335 hartree
zpe.sumelectzpe: -1144.397751 hartree
zpe.sumelectthermal: -1144.378199 hartree
zpe.sumelectthermalent: -1144.377255 hartree
zpe.sumelectthermalfe: -1144.449436 hartree
dipole: -1.7968 -7.5548 -0.3007
dipole: 7.7713
quadrupole: -121.4538 -140.5333 -146.8657
quadrupole: 0.6120 -9.2904 -1.2644
quadrupole: 14.8304 -4.2490 -10.5814 0.6120 -9.2904 -1.2644
hfenergy: -1144.6547711 hartree
pointgroup: C01 [X(C15H11N9O1)]
dipole: -0.7000499 -2.9755944 -0.0626097 debye
polarizability: 519.829791|-0.4831527|208.9671182|3.406282|-4.3641553|93.4113126 unknown
InChI: InChI=1S/C15H11N9O/c25-15(11-3-1-9(2-4-11)13-17-21-22-18-13)16-12-7-5-10(6-8-12)14-19-23-24-20-14/h1-8,16,21,23H
charge 0 multiplicity 1
36 atoms
O  -0.093632 2.153295 0.167755
N  0.444915 -0.120371 -0.084559
N  6.911108 -1.385451 -0.208966
N  -6.680297 -1.532062 0.326302
N  6.980007 0.882222 0.195022
N  -7.10948 0.622094 -0.367157
N  8.183495 -0.895727 -0.100146
N  -8.010332 -1.281231 0.144924
N  8.266539 0.470198 0.144065
N  -8.311283 0.010949 -0.274629
C  1.863904 -0.089689 -0.064305
C  -1.910991 0.551377 0.051468
C  4.704299 -0.198527 -0.036072
C  -4.694195 -0.024015 0.020869
C  -0.454816 0.941929 0.058288
C  2.543625 -1.32355 -0.27315
C  2.618533 1.095858 0.156403
C  -2.384939 -0.737759 0.418114
C  -2.850469 1.55328 -0.305414
C  3.945071 -1.378357 -0.259846
C  4.023405 1.029637 0.17009
C  -3.762335 -1.024313 0.403678
C  -4.22705 1.271445 -0.328522
C  6.166223 -0.244271 -0.019144
C  -6.129826 -0.315935 -0.002814
H  0.033727 -1.037708 -0.271263
H  1.968049 -2.242115 -0.44603
H  2.097029 2.042037 0.305964
H  -1.69432 -1.516427 0.764277
H  -2.472902 2.549755 -0.55449
H  4.462489 -2.329242 -0.421166
H  4.610314 1.937683 0.340227
H  -4.127336 -2.01372 0.696589
H  -4.952494 2.040091 -0.611622
H  9.010798 -1.484169 -0.190791
H  -8.731931 -1.98381 0.303953
