program: Orca
programVersion: 5.0.2
elementType: H C C C C C C H H I C O N C H H C H H C H H H N C O C H H C H H C H H H
elementType: I
charge: 0
multiplicity: 1
keywords: wb97x-d3
keywords: def2-TZVPP
keywords: def2/J RIJCOSX
keywords: DEFGRID2
keywords: scfconv7
keywords: smallprint printgap noloewdin
keywords: NOSOSCF
formula: C14H17IN2O2
InChI: InChI=1/C14H17IN2O2/c1-3-7-17-13(18)11-9-10(15)5-6-12(11)16-14(17)19-8-4-2/h5-6,9H,3-4,7-8H2,1-2H3
36 atoms
H  -1.500014 1.659558 -0.419057
C  -1.246692 0.625693 -0.228175
C  -0.557082 -2.03114 0.269114
C  0.093689 0.261695 -0.06633
C  -2.218851 -0.343352 -0.144343
C  -1.876663 -1.676993 0.108291
C  0.455256 -1.065815 0.180869
H  -2.642833 -2.437177 0.177365
H  -0.290735 -3.061487 0.463848
I  -4.238125 0.171499 -0.397437
C  1.136906 1.273258 -0.141243
O  0.919793 2.464229 -0.300565
N  2.430207 0.791322 -0.025884
C  3.536391 1.755543 -0.072762
H  3.216789 2.580738 -0.703914
H  4.381789 1.294769 -0.578231
C  3.932861 2.267184 1.302867
H  3.061528 2.707793 1.792259
H  4.259652 1.436104 1.931035
C  5.042528 3.300211 1.194082
H  5.343348 3.6550 2.179565
H  4.723307 4.16772 0.614504
H  5.927522 2.884813 0.709328
N  1.75858 -1.443453 0.341052
C  2.66085 -0.536431 0.235334
O  3.937508 -0.812702 0.370946
C  4.337366 -2.160151 0.668812
H  3.924788 -2.840286 -0.078528
H  3.942153 -2.443032 1.64595
C  5.847224 -2.200699 0.65777
H  6.241419 -1.506622 1.404582
H  6.130863 -3.200811 0.992549
C  6.458993 -1.922974 -0.707063
H  6.24041 -0.914544 -1.059504
H  6.085959 -2.624315 -1.455201
H  7.543594 -2.024966 -0.672692
elementType: H C I O N
totalener: -1101.59293227 hartree
nucrepener: 1627.12373131 hartree
electener: -2728.71666358 hartree
oneelecener: -4843.36622214 hartree
twoeener: 2114.64955855 hartree
cpcmener: -0.02454079 hartree
kineticenergy: 913.82497066 hartree
xcener: -93.623753034990 hartree
chargesum: -0.0000000
charge: 0.140849 -0.134933 -0.219477 -0.095967 -0.057053 -0.119054 0.138637 0.153753 0.140631 0.039911 0.401944 -0.531719 -0.074823 -0.054152 0.106181 0.115036 -0.094582 0.072893 0.072573 -0.275920 0.093175 0.085606 0.084089 -0.410229 0.465056 -0.304021 0.014939 0.099175 0.112669 -0.097857 0.066412 0.070368 -0.257870 0.080859 0.079875 0.093029
qa: 0.1408 -0.1349 -0.2195 -0.0960 -0.0571 -0.1191 0.1386 0.1538 0.1406 0.0399 0.4019 -0.5317 -0.0748 -0.0542 0.1062 0.1150 -0.0946 0.0729 0.0726 -0.2759 0.0932 0.0856 0.0841 -0.4102 0.4651 -0.3040 0.0149 0.0992 0.1127 -0.0979 0.0664 0.0704 -0.2579 0.0809 0.0799 0.0930
va: 1.0293 3.9049 4.0525 3.6873 4.0378 3.9275 3.9691 0.9913 1.0182 1.1959 4.1138 1.9790 3.3094 3.7916 1.0251 1.0055 3.8634 1.0166 1.0201 3.9401 1.0029 1.0008 1.0008 3.0649 4.0833 2.1178 3.8262 1.0063 1.0069 3.9337 1.0135 1.0115 3.9227 1.0046 1.0027 1.0047
dispcorr: -0.015976358 hartree
energy: -1101.608908631064
dipole: 369.62267 -367.47666 2.14600 -11.69375 10.09338 -1.60038 35.53804 -35.08233 0.45571
magnitude: 2.71555 au
magnitude: 6.90238 debye
