program: Orca
programVersion: 5.0.2
elementType: H C C C C C C H H I C O N C H H C H H C H H H N C O C H H C H H C H H H
elementType: I
charge: 0
multiplicity: 1
keywords: wb97x-d3
keywords: def2-TZVPP
keywords: def2/J RIJCOSX
keywords: DEFGRID2
keywords: scfconv7
keywords: smallprint printgap noloewdin
keywords: NOSOSCF
formula: C14H17IN2O2
InChI: InChI=1/C14H17IN2O2/c1-3-7-17-13(18)11-9-10(15)5-6-12(11)16-14(17)19-8-4-2/h5-6,9H,3-4,7-8H2,1-2H3
36 atoms
H  -1.520579 1.603205 -0.257223
C  -1.200287 0.585854 -0.07794
C  -0.335189 -2.024626 0.387663
C  0.126875 0.335143 0.283381
C  -2.074673 -0.469113 -0.194006
C  -1.643388 -1.780775 0.037704
C  0.576488 -0.967563 0.520511
H  -2.331106 -2.610215 -0.056952
H  -0.00094 -3.038489 0.563693
I  -4.076161 -0.11406 -0.718149
C  1.067903 1.437431 0.408395
O  0.785644 2.603437 0.180239
N  2.339844 1.07799 0.822082
C  3.349365 2.135987 0.955257
H  4.014277 1.882331 1.776955
H  2.829035 3.043251 1.252835
C  4.131976 2.370567 -0.327128
H  4.63987 1.450938 -0.62675
H  3.441615 2.626298 -1.134008
C  5.148745 3.484594 -0.141228
H  4.663397 4.427061 0.117532
H  5.720423 3.648339 -1.054401
H  5.857299 3.246666 0.653778
N  1.869877 -1.234233 0.868175
C  2.67617 -0.243145 0.990405
O  3.939629 -0.396124 1.321126
C  4.539174 -1.701008 1.392904
H  3.779322 -2.46167 1.563149
H  5.187318 -1.663281 2.267464
C  5.350221 -1.985972 0.146464
H  6.131776 -1.228952 0.041626
H  5.865871 -2.932575 0.326942
C  4.53783 -2.080793 -1.135819
H  3.761629 -2.843448 -1.063641
H  5.181722 -2.347024 -1.97436
H  4.057695 -1.134587 -1.39132
elementType: H C I O N
totalener: -1101.59015122 hartree
nucrepener: 1650.65990185 hartree
electener: -2752.25005307 hartree
oneelecener: -4890.53175781 hartree
twoeener: 2138.28170475 hartree
cpcmener: -0.02424024 hartree
kineticenergy: 913.81656699 hartree
xcener: -93.624226395272 hartree
chargesum: 0.0000000
charge: 0.140151 -0.134335 -0.221963 -0.092168 -0.056386 -0.118733 0.147363 0.153767 0.143034 0.039052 0.402395 -0.532380 -0.071073 -0.050020 0.114060 0.106371 -0.089179 0.065434 0.074220 -0.278283 0.086188 0.093498 0.084553 -0.407983 0.434064 -0.306325 0.018667 0.103476 0.115156 -0.101085 0.070280 0.076509 -0.271637 0.084702 0.098459 0.080151
qa: 0.1402 -0.1343 -0.2220 -0.0922 -0.0564 -0.1187 0.1474 0.1538 0.1430 0.0391 0.4024 -0.5324 -0.0711 -0.0500 0.1141 0.1064 -0.0892 0.0654 0.0742 -0.2783 0.0862 0.0935 0.0846 -0.4080 0.4341 -0.3063 0.0187 0.1035 0.1152 -0.1011 0.0703 0.0765 -0.2716 0.0847 0.0985 0.0802
va: 1.0289 3.9118 4.0445 3.7099 4.0356 3.9249 3.9390 0.9915 1.0154 1.1957 4.1110 1.9780 3.3041 3.7780 1.0136 1.0234 3.8778 1.0157 1.0165 3.9446 1.0011 1.0026 1.0009 3.0291 4.1176 2.1090 3.8197 1.0228 0.9975 3.8924 1.0099 1.0147 3.9327 1.0062 1.0057 1.0001
dispcorr: -0.017185299 hartree
energy: -1101.607336514022
dipole: 352.45417 -350.18576 2.26841 11.31254 -12.79024 -1.47769 52.55533 -52.08954 0.46580
magnitude: 2.74704 au
magnitude: 6.98241 debye
