program: Orca
programVersion: 5.0.2
elementType: H C C C C C C H H I C O N C H H C H H C H H H N C O C H H C H H C H H H
elementType: I
charge: 0
multiplicity: 1
keywords: wb97x-d3
keywords: def2-TZVPP
keywords: def2/J RIJCOSX
keywords: DEFGRID2
keywords: scfconv7
keywords: smallprint printgap noloewdin
keywords: NOSOSCF
formula: C14H17IN2O2
InChI: InChI=1/C14H17IN2O2/c1-3-7-17-13(18)11-9-10(15)5-6-12(11)16-14(17)19-8-4-2/h5-6,9H,3-4,7-8H2,1-2H3
36 atoms
H  -1.459348 1.670043 -0.053616
C  -1.139577 0.64209 0.049023
C  -0.281385 -1.99854 0.31496
C  0.189417 0.361914 0.382429
C  -2.017198 -0.399141 -0.143118
C  -1.589189 -1.726009 -0.013381
C  0.633755 -0.95608 0.521236
H  -2.279336 -2.544303 -0.167743
H  0.050764 -3.023125 0.417265
I  -4.018834 -0.003486 -0.636265
C  1.13717 1.450109 0.57464
O  0.84214 2.629435 0.457613
N  2.423251 1.057135 0.911801
C  3.465216 2.087081 1.052573
H  4.060183 1.862371 1.93482
H  2.955095 3.024135 1.256093
C  4.352432 2.23125 -0.177172
H  5.043655 3.048839 0.039859
H  4.969573 1.340136 -0.306032
C  3.600172 2.52418 -1.465232
H  4.299408 2.656799 -2.290973
H  3.004925 3.434512 -1.388647
H  2.932081 1.706464 -1.741834
N  1.924642 -1.250996 0.851054
C  2.741302 -0.275098 1.018838
O  3.999678 -0.4614 1.351384
C  4.577168 -1.779973 1.356205
H  3.802188 -2.532992 1.487138
H  5.224364 -1.798335 2.231936
C  5.38355 -2.017967 0.097523
H  6.188055 -1.280726 0.036177
H  5.869626 -2.988421 0.226542
C  4.574817 -2.017253 -1.190802
H  3.778862 -2.76208 -1.165381
H  5.216288 -2.251793 -2.040406
H  4.120565 -1.045622 -1.39418
elementType: H C I O N
totalener: -1101.58898384 hartree
nucrepener: 1671.97786214 hartree
electener: -2773.56684598 hartree
oneelecener: -4933.24752099 hartree
twoeener: 2159.68067501 hartree
cpcmener: -0.02434355 hartree
kineticenergy: 913.81212245 hartree
xcener: -93.624734332218 hartree
chargesum: -0.0000000
charge: 0.139375 -0.138933 -0.221351 -0.065015 -0.052213 -0.119495 0.144786 0.153931 0.143169 0.039083 0.357806 -0.525865 -0.058755 -0.047996 0.112064 0.111007 -0.111648 0.081988 0.072086 -0.281312 0.100479 0.088241 0.080808 -0.406577 0.431879 -0.305610 0.021459 0.103733 0.115074 -0.106758 0.071373 0.078927 -0.265337 0.084608 0.098792 0.076196
qa: 0.1394 -0.1389 -0.2214 -0.0650 -0.0522 -0.1195 0.1448 0.1539 0.1432 0.0391 0.3578 -0.5259 -0.0588 -0.0480 0.1121 0.1110 -0.1116 0.0820 0.0721 -0.2813 0.1005 0.0882 0.0808 -0.4066 0.4319 -0.3056 0.0215 0.1037 0.1151 -0.1068 0.0714 0.0789 -0.2653 0.0846 0.0988 0.0762
va: 1.0296 3.9196 4.0421 3.6846 4.0330 3.9250 3.9451 0.9916 1.0152 1.1958 4.1233 1.9812 3.2612 3.8070 1.0139 1.0237 3.8740 1.0145 1.0120 3.9229 1.0054 1.0080 1.0015 3.0234 4.1209 2.1168 3.8188 1.0235 0.9975 3.8923 1.0090 1.0148 3.9334 1.0070 1.0058 0.9983
dispcorr: -0.018410158 hartree
energy: -1101.607393996632
dipole: 345.02085 -342.70917 2.31168 0.03594 -1.56362 -1.52769 43.23248 -42.94950 0.28297
magnitude: 2.78528 au
magnitude: 7.07961 debye
