program: Gaussian 09
title: 000066162
version: EM64L-G09RevD.01
frameworkgroup: C1[X(C21H24O4)]
method: RPBEPBE
basis: SDD
operation: Freq
keyword: #pfreq=noraman
keyword: PBEPBE/SDD
title: #p freq=noraman PBEPBE/SDD
converged: YES YES NO NO
title: Mulliken charges:
elementType: O O O O C C C C C C C C C C C C C C C C C C C C C H H H H H H H H H H H H H H H H H H H H H H H H
charge: -0.434683 -0.490510 -0.488675 -0.434515 0.183547 -0.627603 -0.627442 0.170448 0.173772 0.269650 0.300151 0.369485 0.349429 -0.732071 -0.757343 -0.755663 -0.734801 -0.575241 -0.584076 -0.589686 -0.578945 0.152061 0.152803 0.127921 0.127709 0.217961 0.228134 0.214367 0.233242 0.209831 0.230889 0.213473 0.220437 0.204284 0.219485 0.211792 0.214603 0.223991 0.226040 0.211359 0.218280 0.281299 0.248662 0.233986 0.264793 0.381569 0.372343 0.371480 0.381980
chargesum: 0.00000
title: Mulliken charges with hydrogens summed into heavy atoms:
elementType: O O O O C C C C C C C C C C C C C C C C C C C C C
charge: -0.053114 -0.118167 -0.117195 -0.052534 0.183547 -0.181508 -0.179833 0.170448 0.173772 0.269650 0.300151 0.369485 0.349429 -0.077879 -0.113137 -0.105277 -0.079122 -0.293942 -0.335414 -0.355700 -0.314152 0.152061 0.152803 0.127921 0.127709
polarizability: 2.94814372e+02 -7.63812090e-01 2.39152205e+02 1.23304772e+01 -9.47252287e-01 1.92431906e+02
1716.lowfreq: -8.5206 -0.0004 0.0004 0.0005 5.3416 9.1977 36.0284 46.6840 50.8157
frequency: 36.0259 46.6625 50.8033 78.7854 83.2010 105.4495 136.7675 155.5342 159.6508 196.2109 215.3452 222.2468 222.6935 230.1056 236.5966 249.7344 253.9807 256.0050 260.2037 265.7126 277.6696 283.2883 286.3031 300.1694 308.1507 322.2955 343.2347 382.6613 405.7863 407.9964 417.3497 425.0122 447.6305 476.5778 479.2600 481.9559 484.0855 508.7924 532.3790 556.5823 573.1843 586.6269 612.1920 631.5737 670.0479 673.2203 703.1253 722.9440 741.1441 746.8187 771.3246 782.3331 800.8139 834.9524 838.5193 847.5686 862.1976 875.5759 877.2412 887.9282 922.8045 923.2626 929.7774 934.0822 953.8144 987.6852 992.1553 1003.8719 1031.5266 1036.8270 1046.4661 1088.2716 1094.7324 1113.9559 1132.4093 1149.1996 1163.5705 1167.8102 1171.2110 1184.4242 1189.3057 1206.2563 1208.2491 1211.6476 1225.6149 1255.7817 1257.3232 1270.9286 1281.0718 1299.5144 1310.3956 1332.7548 1344.3554 1371.5167 1372.0392 1390.4610 1391.0112 1401.9843 1406.8133 1442.2241 1446.5457 1458.4571 1458.7842 1462.1649 1465.4584 1468.7006 1474.1565 1478.5521 1479.0029 1483.4541 1487.4240 1499.4669 1501.6753 1610.3474 1614.1214 1624.4884 1626.0581 2966.3260 2968.7680 2970.7596 2972.3979 2995.1868 2997.2552 3053.5100 3056.4023 3059.8148 3061.8787 3064.0195 3067.2102 3071.5334 3073.9611 3080.4468 3081.6868 3106.2187 3110.7103 3151.1694 3153.1805 3522.7719 3524.7319 3624.4810 3624.6159
redmass: 5.8586 4.6842 5.3133 4.2095 3.5826 3.0925 4.5478 3.0776 4.7582 3.2265 2.4678 1.0988 1.0664 2.2067 2.9225 1.2823 1.8038 1.5452 1.3610 1.4625 3.2650 4.6638 3.3864 4.0313 2.8173 3.4792 2.7856 2.2322 3.5287 3.7882 3.5374 2.8114 4.1613 1.7321 3.1141 1.7435 1.1660 3.8020 3.6437 4.4722 3.7948 3.9408 4.5805 4.6717 6.7735 6.5022 5.3796 6.0419 3.3099 3.4448 5.0580 4.6194 4.5864 1.5768 1.8259 2.0003 2.7890 1.6459 1.8005 1.4994 2.1543 1.8228 1.4674 1.6292 1.9647 1.9905 1.4211 1.6809 2.1832 1.9880 2.9424 1.9118 1.8724 1.6149 2.2808 1.8110 1.5612 1.7443 2.8834 1.7817 1.9676 2.2034 2.6030 1.7835 1.9369 1.7365 1.7924 1.9609 1.8185 1.5997 1.8021 3.6674 4.6343 1.2006 1.2002 1.2288 1.2239 5.6436 6.2760 3.8699 3.4484 1.0775 1.0739 1.0593 1.0587 1.0768 1.0900 1.0563 1.0565 1.1252 1.1154 3.5416 3.1713 7.8335 7.9623 7.1928 7.2734 1.0350 1.0349 1.0356 1.0356 1.0606 1.0606 1.1019 1.1018 1.1008 1.1005 1.0995 1.0991 1.1000 1.1000 1.0988 1.0987 1.0912 1.0914 1.0921 1.0922 1.0648 1.0648 1.0665 1.0665
irintensity: 0.0521 0.6734 0.5146 1.9105 0.8618 1.5332 1.0839 0.1972 0.9232 2.3741 0.9395 1.2692 0.3146 25.3863 15.1903 138.0437 43.5989 72.5600 15.8560 2.1160 3.5525 9.4598 2.4777 2.4104 3.0580 3.9616 0.8776 1.3936 6.2940 5.4653 7.9389 7.3081 8.7437 92.7092 22.9656 30.1539 110.7826 2.6136 10.3718 4.5899 3.2070 11.3656 26.1078 14.7637 0.0434 1.9424 1.5272 1.3976 0.6223 1.0749 54.2077 28.3765 4.7779 16.2181 9.5728 21.4596 3.3055 20.3620 6.0604 19.0509 6.4402 1.6447 2.6054 0.7014 4.9383 3.8227 0.6145 4.2334 1.5852 8.6690 66.1635 206.0062 170.8186 15.6428 12.0989 43.5868 19.5147 34.4262 16.0061 132.0325 52.6265 19.4045 13.6575 28.7491 14.2862 12.6045 4.9901 238.1219 192.7322 44.0240 21.9483 32.6015 43.8447 13.9351 28.5428 4.3152 18.6275 22.5641 32.0325 52.2940 28.8379 0.3421 0.5522 2.8975 6.3173 9.3380 0.4389 11.3736 6.8160 2.5803 10.1364 102.2544 113.1112 26.9070 26.1994 4.4685 1.8016 30.5971 26.6913 43.9036 44.5086 42.7278 20.4861 8.6642 10.8689 13.9526 1.8026 73.8748 61.2128 37.3317 66.1783 47.9579 25.1174 21.1851 10.0855 6.0076 2.0128 89.6248 88.8989 34.8572 71.1755
temp: 298.150 k
press: 1.00000 atm
elementType: 8 8 8 8 6 6 6 6 6 6 6 6 6 6 6 6 6 6 6 6 6 6 6 6 6 1 1 1 1 1 1 1 1 1 1 1 1 1 1 1 1 1 1 1 1 1 1 1 1
symmnumber: 1
zpe: 1045675.1 jmol-1
zpe.correction: 0.398277 hartree
zpe.thermalcorrener: 0.422594 hartree
zpe.thermalcorrenthalpy: 0.423538 hartree
zpe.thermalcorrgfe: 0.347169 hartree
zpe.sumelectzpe: -1113.705224 hartree
zpe.sumelectthermal: -1113.680906 hartree
zpe.sumelectthermalent: -1113.679962 hartree
zpe.sumelectthermalfe: -1113.756332 hartree
dipole: 4.4915 1.0209 2.7559
dipole: 5.3676
quadrupole: -141.0397 -142.8789 -147.0569
quadrupole: -2.1917 5.9405 -9.6975
quadrupole: 2.6188 0.7796 -3.3984 -2.1917 5.9405 -9.6975
hfenergy: -1114.1035002 hartree
pointgroup: C01 [X(C21H24O4)]
dipole: -1.6736086 -0.588663 1.1454661 debye
polarizability: 292.1746551|2.5528949|237.7882427|-20.2338447|7.6910421|196.4355858 unknown
InChI: InChI=1S/C21H24O4/c1-19(2)9-21(13-7-17(24)15(22)5-11(13)19)10-20(3,4)12-6-16(23)18(25)8-14(12)21/h5-8,22-25H,9-10H2,1-4H3
charge 0 multiplicity 1
49 atoms
O  -3.036284 3.192197 -1.24846
O  3.145911 2.695769 2.122466
O  -5.046649 2.033609 0.112909
O  5.077353 1.901717 0.426695
C  -0.007148 -0.702857 -0.09158
C  -0.304129 -1.747142 1.053561
C  0.294118 -1.349235 -1.498823
C  -1.862718 -1.855942 1.221226
C  1.853526 -1.399772 -1.687567
C  -1.295169 0.125385 -0.083018
C  1.277784 0.092596 0.14866
C  -2.325407 -0.51283 0.646229
C  2.314453 -0.293229 -0.732055
C  -2.449743 -3.030901 0.3849
C  -2.256059 -2.043794 2.707871
C  2.249062 -1.124365 -3.159785
C  2.445246 -2.770648 -1.246896
C  -1.51784 1.363173 -0.724917
C  1.49819 1.085877 1.128914
C  -3.60552 0.076987 0.739964
C  3.593134 0.297912 -0.645469
C  -2.789273 1.959125 -0.630362
C  2.77072 1.679743 1.205721
C  -3.825216 1.311635 0.100298
C  3.820979 1.289592 0.327793
H  0.156649 -2.72974 0.848126
H  0.130666 -1.367261 1.997735
H  -0.165853 -2.347923 -1.604045
H  -0.138073 -0.69915 -2.283013
H  -3.553739 -3.049437 0.454381
H  -2.182815 -2.936813 -0.682446
H  -2.067784 -4.000848 0.756284
H  -1.893304 -1.201648 3.32517
H  -3.354218 -2.109991 2.830521
H  -1.820775 -2.978041 3.110018
H  3.347233 -1.14534 -3.291751
H  1.816992 -1.893114 -3.828114
H  1.884726 -0.135001 -3.491176
H  2.17234 -3.011076 -0.204027
H  2.074933 -3.582381 -1.90153
H  3.549243 -2.757424 -1.309166
H  -0.728378 1.878019 -1.281368
H  0.687632 1.400643 1.799199
H  -4.413597 -0.408737 1.302718
H  4.414187 0.022724 -1.314752
H  -3.980037 3.449589 -1.074658
H  2.381371 2.993727 2.669975
H  -5.748118 1.557903 0.617501
H  5.041098 2.579517 1.152343
