program: Gaussian 09
title: 000065960
version: EM64L-G09RevD.01
frameworkgroup: C1[X(C11H18N2O5)]
method: RPBEPBE
basis: SDD
operation: Freq
keyword: #p
keyword: freq=noraman
keyword: PBEPBE/SDD
title: #p freq=noraman PBEPBE/SDD
converged: YES YES NO NO
title: Mulliken charges:
elementType: O O O O O N N C C C C C C C C C C C H H H H H H H H H H H H H H H H H H
charge: -0.331394 -0.451393 -0.214609 -0.308030 -0.408196 -0.122385 -0.290380 -0.218418 -0.169997 -0.433806 -0.441856 -0.395575 -0.409366 0.286685 0.145734 -0.501899 -0.640339 0.274278 0.222206 0.254124 0.208610 0.256615 0.220028 0.197910 0.182532 0.209497 0.252742 0.197670 0.284400 0.236610 0.234333 0.238544 0.271959 0.400919 0.378901 0.383346
chargesum: 0.00000
title: Mulliken charges with hydrogens summed into heavy atoms:
elementType: O O O O O N N C C C C C C C C C C C
charge: -0.331394 -0.050474 -0.214609 -0.308030 -0.024850 -0.122385 0.088522 0.003788 0.084127 0.031419 -0.023918 -0.003546 0.041045 0.286685 0.145734 0.019111 0.104497 0.274278
polarizability: 1.70590772e+02 -2.21559288e+00 1.37841772e+02 1.06633125e+01 -7.59218778e+00 1.25719388e+02
1716.lowfreq: -7.4620 -0.0011 -0.0010 -0.0005 10.5961 13.7311 51.0511 58.6703 68.4061
frequency: 51.0265 58.5946 68.3781 87.2369 99.3621 125.5791 134.6087 147.4341 159.1695 161.1119 199.3708 222.1221 245.9881 253.8334 276.2249 290.9164 313.8882 333.9029 349.1402 368.7640 424.9301 431.6961 476.2883 487.0271 511.0137 542.6155 591.0591 620.5554 646.4620 664.4411 705.9121 734.5713 742.7102 760.0852 772.7588 785.5421 822.4627 857.8405 877.9172 908.4092 913.8247 938.2701 940.6550 971.4629 994.1260 1002.2788 1044.9772 1046.7907 1072.7549 1091.1192 1109.3131 1114.4825 1121.0171 1137.3338 1153.3873 1195.7832 1213.4449 1229.6682 1243.5792 1247.8369 1264.5717 1274.8493 1293.5859 1305.8240 1323.5850 1336.1434 1342.0904 1345.5057 1350.0302 1358.0418 1379.3693 1393.0185 1434.9753 1449.3842 1461.9662 1466.1789 1472.0454 1472.9562 1477.9014 1483.7983 1493.8875 1540.3538 1594.3498 1659.3425 2958.1289 2969.6155 2974.3764 2984.8062 2996.4726 3004.4276 3029.8256 3034.2432 3037.7918 3042.6283 3063.7246 3064.8150 3073.1209 3118.9294 3129.7999 3266.2715 3310.1389 3351.1260
redmass: 6.6361 6.4552 5.0799 4.0046 3.3340 5.9133 3.6786 4.6629 5.2143 1.5648 3.7380 4.1261 3.7492 3.3979 4.9508 4.6395 3.9593 2.8043 2.9638 4.5009 3.9498 1.9790 2.7128 2.1321 3.3367 1.5836 3.9222 4.4688 3.1331 6.4556 2.6545 1.7697 3.3562 2.1942 1.9085 1.9696 3.8515 2.4630 2.1176 2.0554 1.6407 2.8466 2.5963 3.0847 2.9725 2.8012 2.0982 2.1817 1.8629 1.6260 1.7045 1.3951 1.3017 2.1863 1.8212 1.5707 1.4556 1.6408 1.5151 1.9145 1.4599 1.3575 1.3275 1.2473 1.2601 1.4196 1.5594 1.6477 1.4547 1.4565 1.6053 2.4354 1.0977 1.4259 1.0857 1.0847 1.0842 1.0457 1.0925 1.5413 1.1780 4.6385 5.3808 8.7832 1.0653 1.0645 1.0822 1.0372 1.0633 1.0639 1.0841 1.0957 1.0960 1.0593 1.1019 1.1016 1.1005 1.1054 1.0971 1.0643 1.0871 1.0662
irintensity: 0.1303 0.9727 0.5532 6.5221 5.1940 4.8482 0.7421 0.9485 3.5823 1.7714 2.1209 10.1956 13.1178 8.8362 14.8325 0.6830 7.0408 12.0681 3.8532 4.4396 0.6093 20.5133 45.8339 6.7011 56.5547 72.6767 21.1067 19.8329 25.1164 5.0778 66.7069 299.6254 11.6887 62.1455 43.7963 60.8423 5.4524 9.2783 5.1174 5.4460 18.4677 31.9447 11.0431 22.4196 17.8423 16.6772 83.5577 140.9914 25.0853 38.7224 9.9448 2.6459 0.8228 2.2872 54.2302 1.3686 4.9044 6.2708 2.7558 27.1304 25.4784 6.2214 14.2967 0.8190 7.5148 15.0280 59.4421 96.4979 8.3891 3.0146 9.9532 49.7955 23.7727 24.7360 3.4385 15.1079 14.5973 14.8795 13.7052 66.7953 27.9895 54.1397 248.5884 231.8179 43.7909 24.0870 25.6138 34.9311 44.2738 22.2878 34.5182 43.1500 31.0334 15.9658 19.8443 20.7860 32.4299 2.6164 15.7140 18.4816 227.6617 223.8321
temp: 298.150 k
press: 1.00000 atm
elementType: 8 8 8 8 8 7 7 6 6 6 6 6 6 6 6 6 6 6 1 1 1 1 1 1 1 1 1 1 1 1 1 1 1 1 1 1
symmnumber: 1
zpe: 768463.4 jmol-1
zpe.correction: 0.292692 hartree
zpe.thermalcorrener: 0.310740 hartree
zpe.thermalcorrenthalpy: 0.311684 hartree
zpe.thermalcorrgfe: 0.247427 hartree
zpe.sumelectzpe: -914.168444 hartree
zpe.sumelectthermal: -914.150396 hartree
zpe.sumelectthermalent: -914.149452 hartree
zpe.sumelectthermalfe: -914.213709 hartree
dipole: -1.5873 -4.7272 2.2323
dipole: 5.4634
quadrupole: -111.8053 -105.0181 -110.0975
quadrupole: 0.9157 -5.4548 0.4294
quadrupole: -2.8317 3.9555 -1.1239 0.9157 -5.4548 0.4294
hfenergy: -914.4611361 hartree
pointgroup: C01 [X(C11H18N2O5)]
dipole: 0.6510381 1.5637208 1.3233237 debye
polarizability: 170.5617225|0.0254767|133.2883164|-10.7975759|9.7623382|130.3018931 unknown
InChI: InChI=1S/C11H18N2O5/c1-13(6-9(14)12-18)10(15)7-4-2-3-5-8(7)11(16)17/h7-8,12,16,18H,2-6H2,1H3
charge 0 multiplicity 1
36 atoms
O  -0.501474 0.981486 -1.547601
O  -0.585133 -1.614947 0.4332
O  1.28524 -2.192422 -0.828763
O  -3.885497 -0.217972 0.90176
O  -2.989065 -1.86302 -1.021166
N  -1.172084 1.661914 0.554651
N  -2.790018 -0.426296 -1.116955
C  1.253479 1.018569 0.157093
C  1.405366 -0.380345 0.88849
C  2.233993 1.153818 -1.035474
C  2.892642 -0.66659 1.229836
C  3.694734 0.909605 -0.598516
C  3.855874 -0.489622 0.03464
C  -0.19068 1.229923 -0.325664
C  0.755687 -1.489596 0.05859
C  -2.565495 1.719112 0.032532
C  -1.027208 1.777967 2.018186
C  -3.157594 0.302687 -0.011209
H  1.521203 1.786593 0.911604
H  0.825061 -0.338511 1.828285
H  2.123539 2.16228 -1.476713
H  1.94581 0.434431 -1.822047
H  2.977797 -1.689407 1.643017
H  3.190514 0.03154 2.039823
H  4.006327 1.688579 0.129909
H  4.361764 1.008967 -1.475619
H  3.643076 -1.265208 -0.723108
H  4.896959 -0.638275 0.379942
H  -2.550585 2.17346 -0.971584
H  -3.176636 2.330536 0.714255
H  -1.515084 2.70548 2.367275
H  0.033296 1.820176 2.303291
H  -1.502131 0.916465 2.524063
H  -1.13418 -2.186835 -0.183392
H  -1.977967 -0.150748 -1.702179
H  -3.654131 -1.917792 -0.260353
