program: Orca
programVersion: 5.0.2
elementType: H C C C C C C H H I C O N C H H C H H C H H H N C O C H H C H H C H H H
elementType: I
charge: 0
multiplicity: 1
keywords: wb97x-d3
keywords: def2-TZVPP
keywords: def2/J RIJCOSX
keywords: DEFGRID2
keywords: scfconv7
keywords: smallprint printgap noloewdin
keywords: NOSOSCF
formula: C14H17IN2O2
InChI: InChI=1/C14H17IN2O2/c1-3-7-17-13(18)11-9-10(15)5-6-12(11)16-14(17)19-8-4-2/h5-6,9H,3-4,7-8H2,1-2H3
36 atoms
H  -1.610003 1.6747 0.137065
C  -1.296376 0.646175 0.022092
C  -0.424023 -1.986773 -0.266375
C  0.057437 0.332214 0.158272
C  -2.193154 -0.360121 -0.251581
C  -1.759101 -1.681623 -0.397703
C  0.509866 -0.982238 0.016399
H  -2.468304 -2.46866 -0.614653
H  -0.075733 -3.004519 -0.37879
I  -4.234827 0.081485 -0.450458
C  1.019742 1.392101 0.449654
O  0.738902 2.56338 0.561912
N  2.336263 0.94805 0.60262
C  3.363929 1.947509 0.897897
H  4.102154 1.504901 1.5639
H  2.875347 2.75151 1.444211
C  4.030655 2.500865 -0.353501
H  4.487721 1.686548 -0.919626
H  3.270482 2.948946 -0.996477
C  5.08649 3.537344 0.00169
H  5.567029 3.930786 -0.893214
H  5.86803 3.111596 0.633207
H  4.65124 4.381616 0.537974
N  1.831948 -1.311299 0.140729
C  2.655872 -0.370394 0.413771
O  3.94858 -0.607984 0.542463
C  4.403271 -1.951692 0.37009
H  4.125625 -2.310112 -0.624335
H  3.912299 -2.603601 1.097093
C  5.905112 -1.955378 0.555345
H  6.364938 -1.274984 -0.165381
H  6.152582 -1.575709 1.549508
C  6.473622 -3.357228 0.380008
H  7.55392 -3.359439 0.516399
H  6.268865 -3.751602 -0.616165
H  6.051608 -4.055542 1.104046
totalener: -1101.58173759 hartree
nucrepener: 1615.96191201 hartree
electener: -2717.54364960 hartree
oneelecener: -4820.80932749 hartree
twoeener: 2103.26567789 hartree
kineticenergy: 913.85061904 hartree
xcener: -93.622709072948 hartree
chargesum: -0.0000000
charge: 0.141930 -0.122516 -0.185426 -0.119565 -0.042347 -0.096211 0.115343 0.122751 0.121515 0.041661 0.333755 -0.391428 -0.100081 -0.051068 0.100990 0.113019 -0.104874 0.064433 0.081219 -0.261124 0.087481 0.074344 0.083944 -0.369725 0.411761 -0.289693 0.023948 0.087590 0.089571 -0.078009 0.062803 0.062737 -0.256377 0.090105 0.078932 0.078612
qa: 0.1419 -0.1225 -0.1854 -0.1196 -0.0423 -0.0962 0.1153 0.1228 0.1215 0.0417 0.3338 -0.3914 -0.1001 -0.0511 0.1010 0.1130 -0.1049 0.0644 0.0812 -0.2611 0.0875 0.0743 0.0839 -0.3697 0.4118 -0.2897 0.0239 0.0876 0.0896 -0.0780 0.0628 0.0627 -0.2564 0.0901 0.0789 0.0786
va: 1.0248 3.9242 4.0657 3.7356 4.0619 3.9481 4.0354 1.0026 1.0234 1.2199 4.1612 2.1269 3.2997 3.7966 1.0145 1.0250 3.8687 1.0196 1.0165 3.9472 1.0051 1.0027 1.0030 3.0679 4.1148 2.1179 3.8623 1.0093 1.0092 3.8946 1.0102 1.0103 3.9523 1.0054 1.0037 1.0038
dispcorr: -0.015404813 hartree
energy: -1101.597142400871
dipole: 369.96323 -368.11132 1.85191 -7.14502 6.18922 -0.95580 35.60814 -35.56430 0.04384
magnitude: 2.08448 au
magnitude: 5.29832 debye
