program: Orca
programVersion: 5.0.2
elementType: H C C C C C C H H I C O N C H H C H H C H H H N C O C H H C H H C H H H
elementType: I
charge: 0
multiplicity: 1
keywords: wb97x-d3
keywords: def2-TZVPP
keywords: def2/J RIJCOSX
keywords: DEFGRID2
keywords: scfconv7
keywords: smallprint printgap noloewdin
keywords: NOSOSCF
formula: C14H17IN2O2
InChI: InChI=1/C14H17IN2O2/c1-3-7-17-13(18)11-9-10(15)5-6-12(11)16-14(17)19-8-4-2/h5-6,9H,3-4,7-8H2,1-2H3
36 atoms
H  -1.51821 1.701172 -0.19556
C  -1.165545 0.678871 -0.191406
C  -0.191695 -1.934694 -0.185542
C  0.204751 0.435393 -0.307397
C  -2.027613 -0.386939 -0.075384
C  -1.542188 -1.698759 -0.071659
C  0.707479 -0.867746 -0.306434
H  -2.224289 -2.532972 0.020137
H  0.195102 -2.944612 -0.184292
I  -4.091335 -0.051787 0.097994
C  1.129753 1.559731 -0.427673
O  0.790955 2.720525 -0.440409
N  2.476313 1.191607 -0.535156
C  3.481502 2.254228 -0.645194
H  2.949056 3.144658 -0.969882
H  4.184461 1.990454 -1.43345
C  4.221468 2.538758 0.656962
H  4.849489 1.687135 0.924955
H  4.908033 3.364289 0.451253
C  3.315896 2.906958 1.822741
H  2.658482 2.082878 2.102146
H  2.685624 3.764098 1.588265
H  3.908414 3.15603 2.702988
N  2.044765 -1.126528 -0.420155
C  2.840041 -0.128755 -0.527858
O  4.143565 -0.299292 -0.659347
C  4.663724 -1.631407 -0.626918
H  5.638663 -1.551372 -1.109127
H  4.034781 -2.291454 -1.226657
C  4.811062 -2.163694 0.785475
H  5.423979 -1.474611 1.372012
H  3.83092 -2.210468 1.261735
C  5.446971 -3.547466 0.778141
H  6.439651 -3.534151 0.325061
H  4.839116 -4.262739 0.222464
H  5.556012 -3.930782 1.791613
totalener: -1101.57997121 hartree
nucrepener: 1650.01794103 hartree
electener: -2751.59791224 hartree
oneelecener: -4888.98800785 hartree
twoeener: 2137.39009561 hartree
kineticenergy: 913.85163831 hartree
xcener: -93.625652159130 hartree
chargesum: -0.0000000
charge: 0.140781 -0.129061 -0.185260 -0.083403 -0.036775 -0.099282 0.115379 0.123025 0.121575 0.042121 0.294430 -0.386772 -0.087526 -0.060671 0.119100 0.102087 -0.122905 0.069429 0.069177 -0.250501 0.071845 0.095650 0.089469 -0.388586 0.425608 -0.295259 0.025928 0.104696 0.093521 -0.112910 0.063094 0.083985 -0.259912 0.074173 0.083800 0.089952
qa: 0.1408 -0.1291 -0.1853 -0.0834 -0.0368 -0.0993 0.1154 0.1230 0.1216 0.0421 0.2944 -0.3868 -0.0875 -0.0607 0.1191 0.1021 -0.1229 0.0694 0.0692 -0.2505 0.0718 0.0957 0.0895 -0.3886 0.4256 -0.2953 0.0259 0.1047 0.0935 -0.1129 0.0631 0.0840 -0.2599 0.0742 0.0838 0.0900
va: 1.0253 3.9417 4.0674 3.7298 4.0566 3.9523 4.0149 1.0027 1.0216 1.2200 4.1643 2.1279 3.2521 3.8208 1.0234 1.0148 3.8843 1.0143 1.0126 3.9292 1.0067 1.0083 1.0056 3.0173 4.0958 2.1293 3.8279 0.9982 1.0241 3.8741 1.0112 1.0225 3.9536 1.0038 1.0027 1.0049
dispcorr: -0.016873917 hartree
energy: -1101.596845128982
dipole: 350.60361 -348.85252 1.75110 1.00229 -1.91079 -0.90850 -0.36928 0.43193 0.06265
magnitude: 1.97374 au
magnitude: 5.01684 debye
