program: Orca
programVersion: 5.0.2
elementType: Cl Cl O O N C C C C C C C C C C C C C H H H H H H H H H H H
charge: 0
multiplicity: 1
keywords: wb97x-d3
keywords: def2-TZVPP
keywords: def2/J RIJCOSX
keywords: DEFGRID2
keywords: scfconv7
keywords: smallprint printgap noloewdin
keywords: NOSOSCF
formula: C13H11Cl2NO2
InChI: InChI=1/C13H11Cl2NO2/c1-12-6-13(12,2)11(18)16(10(12)17)9-4-7(14)3-8(15)5-9/h3-5H,6H2,1-2H3
29 atoms
Cl 3.304286 -1.34681 2.30324
Cl 3.259805 1.331096 -2.346307
O  -1.382386 -1.902453 -1.223875
O  -1.36422 2.032012 1.028384
N  -1.059044 -0.003935 0.019792
C  -3.259853 -0.684677 -0.28876
C  -3.25331 0.619446 0.465163
C  -3.545389 -0.6667 1.187672
C  -1.831149 -0.988625 -0.580775
C  -1.821963 1.016728 0.57073
C  -4.288108 -1.082887 -1.303897
C  -4.27784 1.702367 0.313105
C  0.355425 -0.004622 0.00808
C  1.021727 0.599705 -1.045925
C  1.040951 -0.610058 1.048749
C  2.425482 -0.601127 1.017867
C  2.406281 0.587809 -1.042789
C  3.126259 -0.00744 -0.019546
H  -4.579326 -0.823661 1.470903
H  -2.824359 -1.074569 1.88646
H  -5.28762 -0.805394 -0.972703
H  -4.105354 -0.600248 -2.264253
H  -4.283667 -2.161584 -1.459646
H  -5.278335 1.279446 0.234063
H  -4.271575 2.367877 1.176267
H  -4.093652 2.301398 -0.578904
H  0.466229 1.066176 -1.848084
H  0.499318 -1.075647 1.860993
H  4.207565 -0.008751 -0.03043
elementType: Cl O N C H
totalener: -1627.73311992 hartree
nucrepener: 1519.64412744 hartree
electener: -3147.37724736 hartree
oneelecener: -5251.84745931 hartree
twoeener: 2104.47021195 hartree
cpcmener: -0.02752960 hartree
kineticenergy: 1623.42994888 hartree
xcener: -110.346859152061 hartree
chargesum: -0.0000000
charge: -0.070947 -0.070993 -0.426273 -0.425905 -0.066578 0.019548 0.022529 -0.127312 0.349356 0.348955 -0.278184 -0.279582 0.056184 -0.214413 -0.221814 0.145623 0.145759 -0.128302 0.099292 0.107175 0.098495 0.103194 0.104208 0.098765 0.104601 0.102814 0.137523 0.137018 0.129263
qa: -0.0709 -0.0710 -0.4263 -0.4259 -0.0666 0.0195 0.0225 -0.1273 0.3494 0.3490 -0.2782 -0.2796 0.0562 -0.2144 -0.2218 0.1456 0.1458 -0.1283 0.0993 0.1072 0.0985 0.1032 0.1042 0.0988 0.1046 0.1028 0.1375 0.1370 0.1293
va: 1.2316 1.2313 2.0915 2.0919 3.0227 3.6773 3.6772 3.9784 4.1089 4.1084 3.9449 3.9450 3.6527 4.1667 4.1597 3.8684 3.8725 4.0404 1.0176 1.0227 1.0034 0.9977 1.0060 1.0033 1.0055 0.9980 1.0216 1.0231 1.0173
dispcorr: -0.014707800 hartree
energy: -1627.747827720699
dipole: -36.61316 34.59032 -2.02285 0.44613 -0.60398 -0.15785 -0.41227 0.70540 0.29314
magnitude: 2.05006 au
magnitude: 5.21084 debye
