program: Orca
programVersion: 5.0.2
elementType: F F O O N N C C C C C C C C C C C C H H H H H H
charge: 0
multiplicity: 1
keywords: wb97x-d3
keywords: def2-TZVPP
keywords: def2/J RIJCOSX
keywords: DEFGRID2
keywords: scfconv7
keywords: smallprint printgap noloewdin
keywords: NOSOSCF
formula: C12H6F2N2O2
InChI: InChI=1/C12H6F2N2O2/c13-12(14)17-10-3-1-2-8(11(10)18-12)9-6-16-5-7(9)4-15/h1-3,5-6,16H
24 atoms
F  -3.39196 1.141259 -1.067238
F  -3.392736 1.143001 1.063748
O  -1.462534 0.887156 -0.00082
O  -2.969404 -0.758433 -0.000104
N  2.43105 2.603868 0.002413
N  4.557867 -1.54911 -0.004672
C  0.576664 -0.524664 0.001174
C  -0.789065 -0.306158 0.000375
C  1.55184 0.562808 0.001028
C  -1.722556 -1.317682 0.000757
C  0.929972 -1.886069 0.002508
C  -2.805805 0.599173 -0.001106
C  -1.380454 -2.644075 0.00185
C  2.98526 0.47985 -0.000532
C  1.263737 1.908585 0.002768
C  -0.009967 -2.902445 0.002758
C  3.482287 1.761303 0.000325
C  3.833076 -0.652431 -0.002686
H  1.971699 -2.167398 0.003506
H  -2.118636 -3.43275 0.002011
H  0.319318 2.421515 0.004457
H  0.33343 -3.927463 0.003689
H  4.503528 2.101373 -0.000395
H  2.497217 3.605839 0.003436
totalener: -920.61384011 hartree
nucrepener: 1267.79386957 hartree
electener: -2188.40770968 hartree
oneelecener: -3775.14611616 hartree
twoeener: 1586.73840648 hartree
kineticenergy: 917.16767639 hartree
xcener: -83.345573360781 hartree
chargesum: -0.0000000
charge: -0.159890 -0.159944 -0.288909 -0.249652 -0.126985 -0.015179 0.028306 0.232341 -0.041315 0.076232 -0.160496 0.516263 -0.129188 0.007329 -0.064101 -0.122376 -0.036326 -0.183280 0.127423 0.132720 0.166383 0.127416 0.171398 0.151830
qa: -0.1599 -0.1599 -0.2889 -0.2497 -0.1270 -0.0152 0.0283 0.2323 -0.0413 0.0762 -0.1605 0.5163 -0.1292 0.0073 -0.0641 -0.1224 -0.0363 -0.1833 0.1274 0.1327 0.1664 0.1274 0.1714 0.1518
va: 1.1427 1.1426 2.1376 2.1730 3.4954 3.1514 3.8363 3.7055 3.7916 3.9648 3.9674 4.6374 3.9815 3.8733 3.9213 3.9942 3.9357 4.0385 1.0365 1.0038 1.0184 1.0029 0.9990 1.0202
dispcorr: -0.009267986 hartree
energy: -920.623108092211
dipole: 13.29051 -13.35835 -0.06784 -3.41658 5.00800 1.59142 0.01865 -0.01390 0.00475
magnitude: 1.59287 au
magnitude: 4.04876 debye
