program: Orca
programVersion: 5.0.2
elementType: Cl Cl N N C C C C C C C C C C C H H H H H H
charge: 0
multiplicity: 1
keywords: wb97x-d3
keywords: def2-TZVPP
keywords: def2/J RIJCOSX
keywords: DEFGRID2
keywords: scfconv7
keywords: smallprint printgap noloewdin
keywords: NOSOSCF
formula: C11H6Cl2N2
InChI: InChI=1/C11H6Cl2N2/c12-10-3-1-2-8(11(10)13)9-6-15-5-7(9)4-14/h1-3,5-6,15H
21 atoms
Cl 0.584449 -1.0430 1.385001
Cl 3.335108 0.390127 1.154339
N  -3.243118 -1.538574 -1.411571
N  -2.197904 1.10705 2.317681
C  -1.406988 -0.431729 -0.857634
C  -0.077005 0.178468 -0.939205
C  -2.385577 -0.293104 0.177525
C  -1.988676 -1.20847 -1.823241
C  0.897305 -0.007989 0.045092
C  0.245847 0.966161 -2.043032
C  -3.507588 -0.994157 -0.211057
C  2.140604 0.606716 -0.068442
C  1.490243 1.560724 -2.162149
C  2.440261 1.392644 -1.169402
C  -2.277173 0.468836 1.357403
H  -1.591638 -1.559078 -2.761227
H  -0.502267 1.119769 -2.809144
H  -4.452577 -1.124448 0.288907
H  -3.88461 -2.116648 -1.933304
H  1.720359 2.170088 -3.025091
H  3.409655 1.86522 -1.246961
elementType: Cl N C H
totalener: -1452.73692199 hartree
nucrepener: 1113.75487086 hartree
electener: -2566.49179285 hartree
oneelecener: -4205.23624967 hartree
twoeener: 1638.74445682 hartree
cpcmener: -0.03418614 hartree
kineticenergy: 1449.16969257 hartree
xcener: -94.367793114800 hartree
chargesum: -0.0000000
charge: -0.060707 -0.069895 -0.109565 -0.127151 0.028935 -0.009955 -0.038548 -0.056648 -0.022927 -0.145568 -0.050509 0.016992 -0.188208 -0.114608 -0.100879 0.189783 0.151016 0.199135 0.203675 0.161232 0.144402
qa: -0.0607 -0.0699 -0.1096 -0.1272 0.0289 -0.0100 -0.0385 -0.0566 -0.0229 -0.1456 -0.0505 0.0170 -0.1882 -0.1146 -0.1009 0.1898 0.1510 0.1991 0.2037 0.1612 0.1444
va: 1.2787 1.2512 3.5050 3.1555 3.5191 3.5318 3.7697 3.8954 3.9707 3.9179 3.9540 3.9399 3.9752 3.9496 4.0385 0.9891 1.0023 0.9868 0.9873 0.9909 1.0058
dispcorr: -0.009395402 hartree
energy: -1452.746317392536
dipole: -10.31666 8.83226 -1.48439 1.23120 -2.68169 -1.45050 -14.16412 10.26535 -3.89876
magnitude: 4.41675 au
magnitude: 11.22650 debye
