program: Gaussian 09
title: 000066000
version: EM64L-G09RevD.01
frameworkgroup: C1[X(C20H21N3O4)]
method: RPBEPBE
basis: SDD
operation: Freq
keyword: #p
keyword: freq=noraman
keyword: PBEPBE/SDD
title: #p freq=noraman PBEPBE/SDD
converged: YES YES NO NO
title: Mulliken charges:
elementType: O O O O N N N C C C C C C C C C C C C C C C C C C C C H H H H H H H H H H H H H H H H H H H H H
charge: -0.278816 -0.249374 -0.409151 -0.243373 -0.352513 -0.658011 -0.372778 -0.181237 -0.127666 -0.497490 0.122015 -0.539800 -0.303468 0.190851 0.363987 -0.361540 -0.402266 0.350177 -0.394786 -0.370377 0.361354 -0.416037 -0.396731 0.353458 -0.385031 -0.376858 0.065659 0.278916 0.259496 0.246921 0.231976 0.333043 0.257602 0.298547 0.224602 0.215715 0.245966 0.248610 0.378331 0.237366 0.243295 0.235515 0.236774 0.216871 0.281599 0.315231 0.312918 0.210512
chargesum: 0.00000
title: Mulliken charges with hydrogens summed into heavy atoms:
elementType: O O O O N N N C C C C C C C C C C C C C C C C C C C C
charge: -0.278816 -0.249374 -0.030820 -0.243373 -0.019470 -0.029863 -0.162267 0.097679 0.131830 -0.018592 0.122015 0.016349 0.136849 0.190851 0.363987 -0.115573 -0.153656 0.350177 -0.157420 -0.127083 0.361354 -0.180522 -0.159957 0.353458 -0.168159 -0.095260 0.065659
polarizability: 4.50278316e+02 1.00318202e+01 2.31686182e+02 1.78833396e+01 -1.36778960e+01 1.45519241e+02
1716.lowfreq: -9.2290 -3.6275 -2.2937 -0.0011 0.0003 0.0009 10.7362 17.8893 22.0318
frequency: 10.6376 17.3286 22.0140 30.8212 40.6887 49.8084 55.9745 61.8865 76.4163 81.1681 105.1925 135.1336 142.2654 155.1520 172.4289 193.4739 226.6801 238.6091 252.5673 270.3904 336.6784 358.1310 392.9875 398.3686 407.2486 412.1516 417.0164 426.1729 444.2505 450.3789 477.3106 494.5163 500.9286 506.1565 512.4170 548.3630 568.3891 573.2931 603.7370 625.3315 627.5606 639.9371 643.9448 652.0576 656.4306 674.0156 719.0176 725.0837 756.9981 765.9098 806.9266 809.8614 814.9265 828.5624 833.2649 845.4650 847.5625 865.0932 869.9510 902.5913 940.5053 957.3384 959.0928 962.3593 981.7619 990.8503 993.8126 996.9203 1009.0680 1024.9027 1033.0670 1035.6927 1053.7790 1073.5647 1085.9942 1098.7495 1122.1364 1123.3437 1143.6716 1145.6113 1174.1929 1183.0688 1188.4030 1202.5580 1218.2262 1226.5989 1231.3123 1248.8907 1260.0231 1275.5560 1292.5844 1303.5387 1304.5702 1306.4695 1328.1750 1339.0015 1350.8873 1369.7707 1374.3722 1380.3092 1383.1508 1390.4394 1417.4212 1423.5009 1435.5947 1466.0651 1473.9251 1489.6080 1523.1094 1556.7368 1579.1765 1598.7868 1617.1940 1624.9576 1633.5658 1659.1642 1663.8497 2956.0618 2991.0449 2995.7196 3010.2404 3018.3558 3036.1544 3051.1543 3087.7416 3118.7025 3134.0221 3135.4760 3140.6929 3146.2116 3161.9198 3167.0597 3168.8575 3323.9125 3512.2173 3535.5715 3574.7504 3680.3202
redmass: 6.6346 6.6936 5.3312 9.8017 6.3161 4.7724 5.3392 4.5294 5.5155 3.9568 5.5169 4.0594 4.9953 4.9324 3.7573 4.3063 7.7242 4.2503 4.3910 5.6287 4.3593 3.3232 2.5231 2.6660 3.5839 2.8704 1.6431 2.8326 1.3687 3.3119 3.2674 2.3386 2.9745 3.6434 2.6581 2.5185 3.6726 4.1099 3.0834 2.3888 3.6752 6.4797 1.3781 4.5452 3.1337 3.2258 4.2893 3.6060 3.8189 5.3233 5.4992 1.3786 1.3597 3.1406 1.5015 1.4875 1.8646 3.8014 1.5790 2.4122 1.3819 2.4870 1.4424 1.3632 2.7192 4.1043 1.4650 2.6118 2.8897 2.6277 2.0079 1.7290 2.5117 1.5329 1.9462 2.2007 1.4104 1.3814 2.0048 2.1502 1.3465 1.3050 1.2865 1.2408 1.4152 2.2013 1.4228 1.4835 1.6578 1.9183 2.6276 1.4451 1.4638 1.2970 1.5203 2.8451 1.5562 3.3474 2.0440 1.7050 4.0504 2.0442 3.7338 3.7665 1.0875 1.1319 1.0916 2.2638 3.0129 6.3919 6.8698 3.1864 6.2024 6.4643 1.4285 8.3375 8.7832 1.0552 1.0691 1.0752 1.0808 1.0809 1.0953 1.0973 1.1024 1.0869 1.0893 1.0882 1.0881 1.0948 1.0949 1.0962 1.0955 1.0762 1.0640 1.0451 1.0786 1.1035
irintensity: 0.5389 0.6427 2.8846 0.6758 1.0395 2.9489 2.1809 3.9654 2.2078 0.8399 2.7619 3.3129 0.5397 4.9141 3.7946 8.0223 1.4346 2.0800 2.3257 0.3333 11.5186 0.9286 11.6897 19.9508 16.7214 8.4871 89.6987 8.1794 160.2737 38.7454 3.5952 20.0730 27.3753 24.8110 14.9633 4.8346 11.4009 31.1802 76.3304 52.6659 29.9626 0.4641 125.4154 19.5133 6.5990 79.0606 1.8323 2.4251 12.0170 2.5038 15.5584 22.2958 49.4646 8.3105 130.3189 3.5332 3.2950 2.5186 32.4216 3.2364 0.9160 44.8266 3.9844 1.2290 42.4122 17.8366 8.4251 33.8732 1.9509 28.4694 52.8679 6.2954 306.6717 131.9336 7.7047 10.0942 17.8004 2.1623 42.3925 11.8629 49.0049 164.0481 9.9567 59.6658 50.4603 268.4545 1.3399 7.9144 26.7713 103.3103 11.7253 3.5249 5.7804 0.5410 40.1745 12.4369 30.1565 17.8400 31.6546 51.6461 122.5581 22.8245 33.5698 0.6774 39.4648 70.1430 20.3932 159.2061 25.2332 10.3757 40.0163 95.2295 141.8937 8.5284 189.3863 311.0791 294.7882 39.4031 7.0426 13.8468 14.7565 8.4239 70.7784 6.1664 20.7335 24.4077 4.3325 23.3950 10.5423 13.8238 18.3702 4.2523 4.1753 32.0078 27.1181 18.6843 36.0048 18.7488
temp: 298.150 k
press: 1.00000 atm
elementType: 8 8 8 8 7 7 7 6 6 6 6 6 6 6 6 6 6 6 6 6 6 6 6 6 6 6 6 1 1 1 1 1 1 1 1 1 1 1 1 1 1 1 1 1 1 1 1 1
symmnumber: 1
zpe: 994400.5 jmol-1
zpe.correction: 0.378747 hartree
zpe.thermalcorrener: 0.403784 hartree
zpe.thermalcorrenthalpy: 0.404728 hartree
zpe.thermalcorrgfe: 0.318966 hartree
zpe.sumelectzpe: -1237.956978 hartree
zpe.sumelectthermal: -1237.931941 hartree
zpe.sumelectthermalent: -1237.930997 hartree
zpe.sumelectthermalfe: -1238.016760 hartree
dipole: 0.5249 5.0101 -3.0679
dipole: 5.8982
quadrupole: -143.2415 -148.8082 -166.8636
quadrupole: 16.7449 22.0785 6.0999
quadrupole: 9.7296 4.1629 -13.8925 16.7449 22.0785 6.0999
hfenergy: -1238.3357253 hartree
pointgroup: C01 [X(C20H21N3O4)]
dipole: -0.205122 -1.1407076 -2.01036 debye
polarizability: 450.7538069|14.4153232|199.6689943|-8.4738096|43.9515579|177.0609382 unknown
InChI: InChI=1S/C20H21N3O4/c21-19(22)14-3-1-12(2-4-14)13-5-7-17(8-6-13)27-11-16-9-15(10-18(24)25)20(26)23-16/h1-8,15-16,21,23-24H,9-11,22H2
charge 0 multiplicity 1
48 atoms
O  1.634506 1.43131 -0.147179
O  5.738674 0.68282 2.629179
O  9.077627 -1.86543 -0.53693
O  6.928798 -2.573095 -1.054022
N  4.326045 1.45799 0.897918
N  -8.679153 -1.884347 -0.629966
N  -9.018076 0.101259 0.71403
C  5.747166 -0.342026 0.339954
C  3.992819 1.173589 -0.509763
C  5.185273 0.274407 -0.96705
C  5.303469 0.642446 1.445919
C  7.262017 -0.581999 0.381849
C  2.631926 0.47421 -0.650237
C  7.682517 -1.761332 -0.469812
C  0.282287 1.043519 -0.162711
C  -0.183662 -0.217549 -0.607444
C  -0.638968 2.012075 0.305014
C  -2.511949 0.458895 -0.115281
C  -1.567036 -0.494051 -0.578441
C  -2.0125 1.71866 0.32647
C  -3.969172 0.155266 -0.091655
C  -4.557558 -0.702391 -1.061263
C  -4.826507 0.717326 0.897714
C  -6.778559 -0.442985 -0.037702
C  -5.935432 -0.997514 -1.035875
C  -6.201546 0.427355 0.922749
C  -8.247871 -0.731958 0.039109
H  5.243498 -1.307875 0.544713
H  3.947183 2.115357 -1.086926
H  4.878735 -0.493397 -1.696109
H  5.953952 0.906703 -1.446943
H  3.784782 2.114863 1.461565
H  7.826687 0.312224 0.05756
H  7.572777 -0.768807 1.429387
H  2.602946 -0.459355 -0.051839
H  2.428469 0.237537 -1.71478
H  0.508667 -0.987183 -0.961158
H  -0.261583 2.985176 0.633759
H  9.322712 -2.660661 -1.084093
H  -1.910953 -1.485294 -0.894023
H  -2.713281 2.490615 0.662107
H  -3.939303 -1.109658 -1.869177
H  -4.403575 1.363456 1.675113
H  -6.352038 -1.619836 -1.836941
H  -6.863704 0.858833 1.679397
H  -8.018848 -2.5730 -0.982831
H  -9.669289 -2.118163 -0.655896
H  -10.01727 -0.189984 0.74304
