program: Orca
programVersion: 5.0.2
elementType: Cl Cl O O N C C C C C C C C C C H H H H H H H
charge: 0
multiplicity: 1
keywords: wb97x-d3
keywords: def2-TZVPP
keywords: def2/J RIJCOSX
keywords: DEFGRID2
keywords: scfconv7
keywords: smallprint printgap noloewdin
keywords: NOSOSCF
formula: C10H7Cl2NO2
InChI: InChI=1/C10H7Cl2NO2/c11-6-3-7(12)5-8(4-6)13-9(14)1-2-10(13)15/h3-5H,1-2H2
22 atoms
Cl 2.598138 -2.529959 0.892972
Cl 2.597734 2.530131 -0.892814
O  -2.039783 -1.598134 -1.612367
O  -2.039957 1.598423 1.61187
N  -1.743023 -0.000198 0.00011
C  -3.953953 -0.536564 -0.539741
C  -3.954026 0.535409 0.540491
C  -2.504757 -0.817984 -0.822629
C  -2.504854 0.817839 0.822513
C  -0.32964 -0.000134 0.00013
C  0.348612 1.139266 -0.405122
C  0.348799 -1.139449 0.405305
C  1.733008 -1.121196 0.393338
C  1.732825 1.121234 -0.393169
C  2.445349 0.000082 0.000092
H  -4.438185 -0.214909 -1.462336
H  -4.440546 -1.460934 -0.226429
H  -4.438037 0.21368 1.463185
H  -4.440907 1.459624 0.227198
H  -0.193636 2.015552 -0.733484
H  -0.193319 -2.015794 0.733707
H  3.526633 0.000166 0.000068
elementType: Cl O N C H
totalener: -1511.01567985 hartree
nucrepener: 1148.71134724 hartree
electener: -2659.72702708 hartree
oneelecener: -4356.17019463 hartree
twoeener: 1696.44316755 hartree
cpcmener: -0.02808409 hartree
kineticenergy: 1507.27363442 hartree
xcener: -98.205820825934 hartree
chargesum: -0.0000000
charge: -0.072181 -0.072179 -0.434550 -0.434550 -0.062614 -0.085888 -0.085934 0.296697 0.296743 0.112824 -0.215565 -0.215561 0.129079 0.129012 -0.131927 0.106669 0.107052 0.106728 0.107014 0.144092 0.144085 0.130954
qa: -0.0722 -0.0722 -0.4345 -0.4345 -0.0626 -0.0859 -0.0859 0.2967 0.2967 0.1128 -0.2156 -0.2156 0.1291 0.1290 -0.1319 0.1067 0.1071 0.1067 0.1070 0.1441 0.1441 0.1310
va: 1.2301 1.2301 2.0798 2.0798 3.0389 3.9035 3.9036 4.1327 4.1326 3.7049 4.1300 4.1302 3.8943 3.8944 4.0331 1.0174 1.0178 1.0174 1.0178 1.0188 1.0188 1.0158
dispcorr: -0.010113622 hartree
energy: -1511.025793466799
dipole: -20.75896 18.89438 -1.86458 -0.00248 0.00180 -0.00067 0.00132 -0.00070 0.00062
magnitude: 1.86458 au
magnitude: 4.73939 debye
