program: Orca
programVersion: 5.0.2
elementType: Cl Cl O O O O O N C C C C C C C C C C C C C H H H H H H H H H H H
charge: 0
multiplicity: 1
keywords: wb97x-d3
keywords: def2-TZVPP
keywords: def2/J RIJCOSX
keywords: DEFGRID2
keywords: scfconv7
keywords: smallprint printgap noloewdin
keywords: NOSOSCF
formula: C13H11Cl2NO5
InChI: InChI=1/C13H11Cl2NO5/c1-3-20-11(18)13(2)10(17)16(12(19)21-13)9-5-7(14)4-8(15)6-9/h4-6H,3H2,1-2H3
32 atoms
Cl 3.714532 -2.51016 -0.86252
Cl 4.137199 2.632069 0.608539
O  -2.317878 -0.264586 1.448966
O  -2.926804 -0.819914 -1.116503
O  -0.940058 1.914147 -0.892279
O  -4.55707 0.700592 -0.85253
O  -0.559194 -1.457877 2.131249
N  -0.352516 0.224801 0.563032
C  -2.579892 0.794747 0.529059
C  -1.209984 1.093078 -0.062647
C  -3.164846 1.994386 1.234481
C  -3.493535 0.228244 -0.565336
C  -1.02818 -0.596367 1.454054
C  1.04349 0.163739 0.344929
C  1.804876 1.297835 0.576514
C  1.610246 -1.01774 -0.106382
C  -3.651062 -1.563208 -2.121323
C  2.978841 -1.04867 -0.312346
C  3.167041 1.230209 0.339068
C  3.774503 0.065173 -0.099473
C  -4.61427 -2.542602 -1.496237
H  -3.305738 2.812074 0.529609
H  -4.128165 1.751003 1.679767
H  -2.492208 2.334759 2.021425
H  1.347756 2.206811 0.943104
H  0.997703 -1.887687 -0.298386
H  -4.155491 -0.873503 -2.798561
H  -2.875716 -2.081325 -2.681759
H  4.841407 0.025816 -0.270726
H  -5.082174 -3.128713 -2.287686
H  -4.101417 -3.234814 -0.828491
H  -5.408151 -2.044502 -0.94014
elementType: Cl O N C H
totalener: -1853.47364342 hartree
nucrepener: 1963.05711530 hartree
electener: -3816.53075872 hartree
oneelecener: -6446.11049416 hartree
twoeener: 2629.57973544 hartree
cpcmener: -0.02932603 hartree
kineticenergy: 1848.44313277 hartree
xcener: -128.629013455136 hartree
chargesum: -0.0000000
charge: -0.068034 -0.067711 -0.276136 -0.262499 -0.390051 -0.401834 -0.386563 -0.060566 0.348625 0.246096 -0.275395 0.326179 0.417033 0.113627 -0.209489 -0.202308 0.007168 0.119673 0.121430 -0.127266 -0.244337 0.114679 0.121471 0.121584 0.147638 0.145612 0.098770 0.110640 0.129704 0.098037 0.091819 0.092404
qa: -0.0680 -0.0677 -0.2761 -0.2625 -0.3901 -0.4018 -0.3866 -0.0606 0.3486 0.2461 -0.2754 0.3262 0.4170 0.1136 -0.2095 -0.2023 0.0072 0.1197 0.1214 -0.1273 -0.2443 0.1147 0.1215 0.1216 0.1476 0.1456 0.0988 0.1106 0.1297 0.0980 0.0918 0.0924
va: 1.2340 1.2347 2.1613 2.1923 2.1373 2.1081 2.1308 3.1308 3.7241 4.2495 3.9601 4.2795 4.4097 3.7207 4.1089 4.1125 3.8544 3.9169 3.9151 4.0338 3.9226 1.0110 1.0055 1.0024 1.0183 1.0211 1.0078 0.9957 1.0160 1.0072 1.0037 1.0106
dispcorr: -0.016414699 hartree
energy: -1853.490058115195
dipole: -33.64867 33.23544 -0.41323 -4.15821 3.92173 -0.23648 -4.31834 3.83919 -0.47915
magnitude: 0.67548 au
magnitude: 1.71693 debye
