program: Orca
programVersion: 5.0.2
elementType: Cl Cl O O O O O N C C C C C C C C C C C C C H H H H H H H H H H H
charge: 0
multiplicity: 1
keywords: wb97x-d3
keywords: def2-TZVPP
keywords: def2/J RIJCOSX
keywords: DEFGRID2
keywords: scfconv7
keywords: smallprint printgap noloewdin
keywords: NOSOSCF
formula: C13H11Cl2NO5
InChI: InChI=1/C13H11Cl2NO5/c1-3-20-11(18)13(2)10(17)16(12(19)21-13)9-5-7(14)4-8(15)6-9/h4-6H,3H2,1-2H3
32 atoms
Cl 3.651144 -1.908574 -1.855535
Cl 4.444441 1.999223 1.735972
O  -2.172234 0.339904 1.571841
O  -4.174667 -0.533226 -1.082145
O  -0.936364 0.836049 -1.643743
O  -2.747608 -1.820013 0.067691
O  -0.333101 -0.051969 2.772367
N  -0.236277 0.382708 0.506446
C  -2.509255 0.550327 0.205332
C  -1.151484 0.624947 -0.48432
C  -3.309985 1.821014 0.035453
C  -3.173158 -0.749115 -0.274614
C  -0.859576 0.191776 1.731355
C  1.161777 0.279628 0.321403
C  2.004396 1.11747 1.034284
C  1.649154 -0.661508 -0.570987
C  -4.853311 -1.676771 -1.651825
C  3.019495 -0.748336 -0.745521
C  3.369474 0.983621 0.84614
C  3.897375 0.06045 -0.04241
C  -6.089349 -1.173053 -2.347325
H  -3.493288 2.019919 -1.018364
H  -4.268542 1.749186 0.547384
H  -2.757577 2.665214 0.447741
H  1.605044 1.857804 1.713823
H  0.977124 -1.320578 -1.103438
H  -4.173758 -2.172185 -2.347411
H  -5.10768 -2.38009 -0.857928
H  4.966167 -0.026676 -0.182092
H  -5.850997 -0.463419 -3.139793
H  -6.605573 -2.018669 -2.802076
H  -6.778739 -0.700323 -1.64747
elementType: Cl O N C H
totalener: -1853.47402459 hartree
nucrepener: 1941.18141319 hartree
electener: -3794.65543778 hartree
oneelecener: -6402.84903130 hartree
twoeener: 2608.19359352 hartree
cpcmener: -0.03089323 hartree
kineticenergy: 1848.44735823 hartree
xcener: -128.629787859714 hartree
chargesum: 0.0000000
charge: -0.067742 -0.068172 -0.269034 -0.257338 -0.388906 -0.425482 -0.386408 -0.056623 0.312011 0.247645 -0.269332 0.362574 0.410808 0.110592 -0.200061 -0.203296 0.031104 0.117856 0.118030 -0.127521 -0.247763 0.107306 0.123187 0.118776 0.145959 0.147767 0.109673 0.101188 0.131197 0.090768 0.091524 0.089715
qa: -0.0677 -0.0682 -0.2690 -0.2573 -0.3889 -0.4255 -0.3864 -0.0566 0.3120 0.2476 -0.2693 0.3626 0.4108 0.1106 -0.2001 -0.2033 0.0311 0.1179 0.1180 -0.1275 -0.2478 0.1073 0.1232 0.1188 0.1460 0.1478 0.1097 0.1012 0.1312 0.0908 0.0915 0.0897
va: 1.2344 1.2337 2.1637 2.1971 2.1369 2.0950 2.1307 3.1449 3.7685 4.2591 3.9519 4.2545 4.4217 3.7249 4.1080 4.1037 3.8409 3.9157 3.9162 4.0306 3.9732 1.0161 1.0038 1.0031 1.0199 1.0196 0.9933 0.9976 1.0154 1.0029 1.0067 1.0030
dispcorr: -0.015935887 hartree
energy: -1853.489960476066
dipole: -40.65322 38.72217 -1.93105 -0.77568 1.49721 0.72153 -9.46662 8.14224 -1.32438
magnitude: 2.45021 au
magnitude: 6.22795 debye
