program: Orca
programVersion: 5.0.2
elementType: Cl Cl O O O O O N C C C C C C C C C C C C C H H H H H H H H H H H
charge: 0
multiplicity: 1
keywords: wb97x-d3
keywords: def2-TZVPP
keywords: def2/J RIJCOSX
keywords: DEFGRID2
keywords: scfconv7
keywords: smallprint printgap noloewdin
keywords: NOSOSCF
formula: C13H11Cl2NO5
InChI: InChI=1/C13H11Cl2NO5/c1-3-20-11(18)13(2)10(17)16(12(19)21-13)9-5-7(14)4-8(15)6-9/h4-6H,3H2,1-2H3
32 atoms
Cl 4.047207 2.488251 -1.107816
Cl 4.011165 -2.433943 1.02285
O  -2.174538 0.344002 1.658322
O  -4.123531 -0.372447 -1.144323
O  -0.978599 0.749644 -1.585062
O  -3.090434 -1.752378 0.285906
O  -0.322927 -0.041817 2.842126
N  -0.254766 0.323819 0.563518
C  -2.524663 0.574064 0.30109
C  -1.178858 0.575428 -0.417177
C  -3.247635 1.896655 0.152481
C  -3.295334 -0.663139 -0.176099
C  -0.862828 0.179108 1.80302
C  1.14236 0.226477 0.367631
C  1.797721 -0.936404 0.741261
C  1.817412 1.29548 -0.198939
C  -4.858138 -1.452246 -1.76325
C  3.183072 1.176509 -0.393347
C  3.166739 -1.005215 0.549753
C  3.877777 0.037571 -0.021357
C  -5.821189 -0.844473 -2.748012
H  -3.421937 2.125499 -0.896343
H  -4.207031 1.872018 0.667556
H  -2.644076 2.698145 0.578242
H  1.253049 -1.768758 1.165282
H  1.29401 2.20266 -0.468387
H  -4.150724 -2.119224 -2.257756
H  -5.384926 -2.017823 -0.994442
H  4.946197 -0.035044 -0.170961
H  -5.306394 -0.269158 -3.516799
H  -6.370035 -1.645007 -3.243522
H  -6.547379 -0.199012 -2.254953
elementType: Cl O N C H
totalener: -1853.47467418 hartree
nucrepener: 1939.24834594 hartree
electener: -3792.72302012 hartree
oneelecener: -6398.88375980 hartree
twoeener: 2606.16073968 hartree
cpcmener: -0.03152547 hartree
kineticenergy: 1848.45030910 hartree
xcener: -128.630933521620 hartree
chargesum: 0.0000000
charge: -0.068280 -0.067850 -0.265854 -0.262903 -0.388622 -0.421720 -0.385832 -0.058180 0.322402 0.236374 -0.276991 0.370892 0.411507 0.117385 -0.201205 -0.209964 0.030882 0.119405 0.117856 -0.129374 -0.247587 0.107204 0.125260 0.119030 0.146034 0.148067 0.107043 0.102136 0.131316 0.090478 0.090972 0.090120
qa: -0.0683 -0.0678 -0.2659 -0.2629 -0.3886 -0.4217 -0.3858 -0.0582 0.3224 0.2364 -0.2770 0.3709 0.4115 0.1174 -0.2012 -0.2100 0.0309 0.1194 0.1179 -0.1294 -0.2476 0.1072 0.1253 0.1190 0.1460 0.1481 0.1070 0.1021 0.1313 0.0905 0.0910 0.0901
va: 1.2340 1.2342 2.1690 2.1887 2.1381 2.0991 2.1307 3.1466 3.7523 4.2687 3.9664 4.2477 4.4178 3.7196 4.1057 4.1060 3.8449 3.9176 3.9191 4.0323 3.9713 1.0164 1.0022 1.0031 1.0214 1.0183 0.9938 0.9963 1.0154 1.0033 1.0068 1.0029
dispcorr: -0.015904576 hartree
energy: -1853.490578758024
dipole: -39.59405 37.88395 -1.71010 0.63835 0.20176 0.84011 -10.64827 9.19066 -1.45762
magnitude: 2.39893 au
magnitude: 6.09760 debye
