program: Orca
programVersion: 5.0.2
elementType: Cl Cl O O O O O N C C C C C C C C C C C C C H H H H H H H H H H H
charge: 0
multiplicity: 1
keywords: wb97x-d3
keywords: def2-TZVPP
keywords: def2/J RIJCOSX
keywords: DEFGRID2
keywords: scfconv7
keywords: smallprint printgap noloewdin
keywords: NOSOSCF
formula: C13H11Cl2NO5
InChI: InChI=1/C13H11Cl2NO5/c1-3-20-11(18)13(2)10(17)16(12(19)21-13)9-5-7(14)4-8(15)6-9/h4-6H,3H2,1-2H3
32 atoms
Cl 4.200049 2.341195 1.028757
Cl 3.473774 -2.31689 -1.531551
O  -2.339388 -0.477341 1.532878
O  -3.18714 -0.728921 -0.914015
O  -0.984172 2.112771 -0.357511
O  -4.333421 1.19161 -0.780928
O  -0.577461 -1.786762 1.939105
N  -0.391386 0.152779 0.701888
C  -2.611943 0.729081 0.830281
C  -1.246718 1.14143 0.292389
C  -3.20379 1.769274 1.753211
C  -3.503521 0.424269 -0.378456
C  -1.054806 -0.814246 1.442431
C  0.989492 0.098076 0.401831
C  1.477958 -0.968819 -0.335722
C  1.810981 1.124975 0.836499
C  -3.870852 -1.127388 -2.123638
C  3.15558 1.068561 0.511278
C  2.831877 -0.997121 -0.622927
C  3.686729 0.01298 -0.21163
C  -3.319688 -2.464456 -2.540803
H  -2.535317 1.947714 2.594673
H  -3.34555 2.709253 1.224469
H  -4.16817 1.437559 2.13571
H  0.816306 -1.751027 -0.682727
H  1.411753 1.941124 1.423146
H  -4.942653 -1.183898 -1.926482
H  -3.701443 -0.371519 -2.89254
H  4.740678 -0.021526 -0.450044
H  -2.24955 -2.414675 -2.743574
H  -3.498814 -3.230115 -1.785887
H  -3.817464 -2.77864 -3.458359
elementType: Cl O N C H
totalener: -1853.47489407 hartree
nucrepener: 1966.61635877 hartree
electener: -3820.09125284 hartree
oneelecener: -6453.15720433 hartree
twoeener: 2633.06595149 hartree
cpcmener: -0.03116647 hartree
kineticenergy: 1848.44821878 hartree
xcener: -128.629932408495 hartree
chargesum: -0.0000000
charge: -0.067176 -0.067537 -0.276228 -0.265579 -0.386856 -0.410341 -0.385922 -0.057975 0.355117 0.230536 -0.276318 0.342345 0.414271 0.113807 -0.204723 -0.213314 0.021966 0.125927 0.122202 -0.128562 -0.251799 0.122101 0.109334 0.125201 0.147195 0.147795 0.105901 0.105577 0.129751 0.089056 0.091243 0.093004
qa: -0.0672 -0.0675 -0.2762 -0.2656 -0.3869 -0.4103 -0.3859 -0.0580 0.3551 0.2305 -0.2763 0.3423 0.4143 0.1138 -0.2047 -0.2133 0.0220 0.1259 0.1222 -0.1286 -0.2518 0.1221 0.1093 0.1252 0.1472 0.1478 0.1059 0.1056 0.1298 0.0891 0.0912 0.0930
va: 1.2350 1.2349 2.1634 2.2007 2.1416 2.1071 2.1315 3.1279 3.7441 4.2763 3.9583 4.2581 4.4103 3.7156 4.1130 4.1178 3.8478 3.9079 3.9102 4.0336 3.9747 1.0027 1.0163 1.0027 1.0197 1.0178 0.9940 0.9948 1.0161 1.0022 1.0026 1.0069
dispcorr: -0.016292360 hartree
energy: -1853.491186431670
dipole: -30.53843 30.05295 -0.48548 -3.61069 3.28799 -0.32271 -5.60393 5.20237 -0.40156
magnitude: 0.70787 au
magnitude: 1.79925 debye
