program: Orca
programVersion: 5.0.2
elementType: Cl Cl O O O O O N C C C C C C C C C C C C C H H H H H H H H H H H
charge: 0
multiplicity: 1
keywords: wb97x-d3
keywords: def2-TZVPP
keywords: def2/J RIJCOSX
keywords: DEFGRID2
keywords: scfconv7
keywords: smallprint printgap noloewdin
keywords: NOSOSCF
formula: C13H11Cl2NO5
InChI: InChI=1/C13H11Cl2NO5/c1-3-20-11(18)13(2)10(17)16(12(19)21-13)9-5-7(14)4-8(15)6-9/h4-6H,3H2,1-2H3
32 atoms
Cl 4.421022 -0.959042 2.053856
Cl 3.04341 0.788186 -2.824445
O  -2.391458 -0.842197 1.501154
O  -2.947239 -0.225368 -1.114292
O  -1.026601 2.105141 0.245936
O  -4.672689 0.870369 -0.189473
O  -0.653071 -2.251436 1.507986
N  -0.442158 -0.063673 0.790532
C  -2.652061 0.494006 1.08679
C  -1.290269 1.008979 0.641986
C  -3.247181 1.31171 2.207953
C  -3.569798 0.417035 -0.140715
C  -1.114294 -1.181687 1.286861
C  0.91891 -0.075632 0.41383
C  1.261299 0.315318 -0.871249
C  1.880936 -0.46924 1.330278
C  -3.655448 -0.438819 -2.34533
C  3.207135 -0.47169 0.9335
C  2.597777 0.311212 -1.229995
C  3.58435 -0.080914 -0.340556
C  -2.738496 -1.197265 -3.272349
H  -3.393039 2.339074 1.881365
H  -4.211046 0.908453 2.510183
H  -2.582697 1.316232 3.070883
H  0.503482 0.611615 -1.581561
H  1.607084 -0.770924 2.330468
H  -4.569621 -1.000462 -2.143435
H  -3.944464 0.525306 -2.76845
H  4.624219 -0.083391 -0.633432
H  -3.249082 -1.377463 -4.21783
H  -1.830041 -0.635306 -3.487754
H  -2.456434 -2.163306 -2.855236
totalener: -1853.45372248 hartree
nucrepener: 1978.83226660 hartree
electener: -3832.28598909 hartree
oneelecener: -6477.82889468 hartree
twoeener: 2645.54290559 hartree
kineticenergy: 1848.50688742 hartree
xcener: -128.633417714873 hartree
chargesum: -0.0000000
charge: -0.051880 -0.053741 -0.257890 -0.263092 -0.304158 -0.312151 -0.293216 -0.096361 0.321024 0.169877 -0.240750 0.250605 0.353074 0.146614 -0.172253 -0.169756 0.004866 0.105140 0.100761 -0.142415 -0.238856 0.114351 0.114804 0.102129 0.117696 0.118585 0.097393 0.097926 0.117745 0.087905 0.082760 0.093261
qa: -0.0519 -0.0537 -0.2579 -0.2631 -0.3042 -0.3122 -0.2932 -0.0964 0.3210 0.1699 -0.2408 0.2506 0.3531 0.1466 -0.1723 -0.1698 0.0049 0.1051 0.1008 -0.1424 -0.2389 0.1144 0.1148 0.1021 0.1177 0.1186 0.0974 0.0979 0.1177 0.0879 0.0828 0.0933
va: 1.2514 1.2505 2.1662 2.1687 2.2177 2.1952 2.2197 3.1276 3.7688 4.2798 3.9447 4.3151 4.4491 3.7548 4.1049 4.1279 3.8789 3.9866 3.9813 4.0467 3.9643 1.0135 1.0108 1.0061 1.0305 1.0301 0.9964 0.9960 1.0201 1.0099 1.0040 1.0035
dispcorr: -0.016682988 hartree
energy: -1853.470405472418
dipole: -28.34801 28.07504 -0.27297 0.22683 -0.16340 0.06343 -6.41872 5.87930 -0.53943
magnitude: 0.60788 au
magnitude: 1.54510 debye
