program: Gaussian 09
title: 000065975
version: EM64L-G09RevD.01
frameworkgroup: C1[X(C17H19N3O)]
method: RPBEPBE
basis: SDD
operation: Freq
keyword: #p
keyword: freq=noraman
keyword: PBEPBE/SDD
title: #p freq=noraman PBEPBE/SDD
converged: YES YES NO NO
title: Mulliken charges:
elementType: O N N N C C C C C C C C C C C C C C C C C H H H H H H H H H H H H H H H H H H H
charge: -0.303517 -0.094919 -0.128939 -0.063347 -0.354499 -0.350186 -0.399053 -0.393430 -0.484827 0.194184 0.449837 0.002986 -0.448771 -0.375042 -0.220406 -0.229170 -0.246633 -0.245625 -0.194336 -0.361044 -0.165038 0.205329 0.231153 0.212410 0.193774 0.215365 0.274133 0.262258 0.220769 0.195522 0.220719 0.232525 0.263364 0.224382 0.224435 0.286875 0.227053 0.243701 0.243954 0.234053
chargesum: 0.00000
title: Mulliken charges with hydrogens summed into heavy atoms:
elementType: O N N N C C C C C C C C C C C C C C C C C
charge: -0.303517 -0.094919 -0.128939 -0.063347 0.081983 0.055997 0.090445 0.089598 -0.068586 0.194184 0.449837 0.002986 -0.216246 -0.111678 0.003976 -0.004735 0.040242 -0.018571 0.049365 -0.117090 0.069015
polarizability: 2.69456452e+02 1.36539970e+01 1.95720525e+02 -3.98619793e+00 5.94033483e+00 1.46784662e+02
1716.lowfreq: -14.6500 -0.9311 -0.0004 0.0002 0.0005 9.4294 20.4284 22.3984 32.6654
frequency: 20.2617 22.2768 32.6305 42.9850 52.9000 75.4156 118.2422 160.7393 178.8421 200.3943 227.8438 257.4832 297.4537 315.3346 326.7607 346.1079 393.5065 402.8376 406.4442 409.5489 444.2792 468.6331 476.0389 525.0201 582.7588 605.1878 616.8653 617.9169 642.1298 680.8059 704.8973 712.4442 739.2870 750.5055 778.4698 807.4946 811.0258 843.1688 859.6388 875.2978 913.4637 914.8059 944.7238 968.3822 969.3864 982.0141 989.8076 995.4560 1000.3249 1009.3763 1011.1272 1024.6357 1026.8124 1042.4280 1051.7203 1075.4098 1085.3303 1093.5160 1129.5943 1140.4420 1158.7759 1164.0551 1169.7001 1180.0095 1182.0310 1196.5685 1211.5998 1238.3100 1262.4610 1280.3892 1281.7402 1294.6325 1312.6426 1317.6512 1333.7635 1341.2756 1358.9048 1365.3085 1376.7840 1393.1968 1407.0433 1417.7656 1440.2075 1446.5118 1452.5653 1455.7897 1462.4333 1466.3711 1474.2922 1482.6681 1535.7777 1564.4229 1578.1059 1594.2372 1614.1886 2849.4183 2861.5370 2873.5080 2975.4922 2985.7465 2987.4903 3029.1664 3049.3788 3100.2352 3110.5281 3112.9725 3122.6377 3129.5106 3135.8883 3145.2744 3147.3364 3161.5400 3168.0825 3184.9473
redmass: 4.5782 4.2724 4.7046 4.0540 5.3765 5.1220 4.3172 4.0083 3.4682 4.9262 4.4678 3.8013 2.2455 2.7614 2.4630 4.4415 4.0453 3.0790 2.9075 2.6829 2.9797 3.1746 3.1425 5.4672 4.2647 3.4704 6.3993 6.7008 3.1902 4.6341 2.1832 5.1646 1.6294 1.7677 3.0619 3.8600 2.4747 1.5800 1.2485 3.8009 1.3276 1.4049 2.1603 1.9453 3.0070 1.3911 5.4798 1.4659 2.4189 1.8060 1.3587 2.5527 2.2924 2.1710 1.7477 1.6757 1.6182 2.0766 2.6471 3.4844 1.5533 1.3899 1.0616 1.1322 2.2811 1.0995 2.5550 1.5375 1.6898 1.4963 1.5599 1.4353 1.4147 6.1494 1.2987 1.3043 1.4408 1.3745 2.7318 2.3310 1.8841 2.2152 2.0695 1.1567 2.3696 1.1162 1.1204 1.1209 1.1684 1.9850 6.5697 6.2958 5.7084 6.1608 6.1390 1.0705 1.0708 1.0693 1.0677 1.0858 1.0675 1.0893 1.0895 1.0955 1.0957 1.0869 1.0863 1.0885 1.0915 1.0904 1.0955 1.1014 1.0977 1.0972
irintensity: 0.4625 0.3344 0.9457 0.4368 2.9386 3.5117 0.7879 3.1284 2.9049 4.4173 4.8585 1.1702 0.3810 5.9897 11.8788 0.5661 5.6783 4.3590 0.2977 1.8657 2.8054 16.3667 2.2241 0.7508 6.5023 3.8590 0.0872 14.8649 5.3572 26.8822 35.9132 2.5982 56.2445 41.4621 25.8578 4.1239 24.9156 1.5858 0.2563 0.9945 0.8913 5.9418 2.4416 1.2561 4.9264 1.3631 0.2082 14.5882 87.0902 5.5642 1.1776 21.5510 28.7754 2.1048 2.8398 12.7102 15.3493 8.8632 55.3653 20.1905 9.7244 23.9234 0.3664 1.8242 0.9259 4.5757 5.6725 16.6152 93.1664 5.6340 10.9720 65.6698 30.3158 0.5905 22.5274 0.1842 1.9285 10.5661 1.7752 8.4289 14.1454 68.3592 12.1251 13.3778 4.3158 1.2254 40.5723 6.0150 11.7760 10.3583 280.6309 31.2299 8.0368 0.9460 6.5619 40.6785 67.7626 122.9848 50.7522 30.6247 42.4715 56.5415 27.4523 7.3071 23.0183 8.3678 0.2299 9.5868 19.7036 14.5436 33.7828 27.4106 23.1909 7.9235
temp: 298.150 k
press: 1.00000 atm
elementType: 8 7 7 7 6 6 6 6 6 6 6 6 6 6 6 6 6 6 6 6 6 1 1 1 1 1 1 1 1 1 1 1 1 1 1 1 1 1 1 1
symmnumber: 1
zpe: 862157.6 jmol-1
zpe.correction: 0.328379 hartree
zpe.thermalcorrener: 0.346351 hartree
zpe.thermalcorrenthalpy: 0.347295 hartree
zpe.thermalcorrgfe: 0.279346 hartree
zpe.sumelectzpe: -897.155840 hartree
zpe.sumelectthermal: -897.137868 hartree
zpe.sumelectthermalent: -897.136924 hartree
zpe.sumelectthermalfe: -897.204873 hartree
dipole: 0.0192 -2.7294 0.0649
dipole: 2.7302
quadrupole: -110.8249 -120.9651 -120.1676
quadrupole: -13.3077 3.1550 1.0502
quadrupole: 6.4943 -3.6459 -2.8484 -13.3077 3.1550 1.0502
hfenergy: -897.4842189 hartree
pointgroup: C01 [X(C17H19N3O1)]
dipole: 0.0226751 1.0735541 0.0281122 debye
polarizability: 268.9028328|-14.0336656|195.3227541|-6.0852407|9.5041474|147.7360517 unknown
InChI: InChI=1S/C17H19N3O/c21-17(16-8-4-5-9-18-16)20-12-10-19(11-13-20)14-15-6-2-1-3-7-15/h1-9H,10-14H2
charge 0 multiplicity 1
40 atoms
O  3.201676 -2.297218 -0.394813
N  -1.540625 -1.108441 0.184106
N  1.230713 -1.08879 -0.615786
N  2.967822 1.295303 -0.011226
C  -0.748319 0.146836 0.218803
C  -0.672004 -2.286879 0.422948
C  0.383088 0.109535 -0.825725
C  0.450575 -2.349264 -0.629198
C  -2.715122 -1.071217 1.086961
C  2.605232 -1.165328 -0.467924
C  -3.792731 -0.093262 0.625689
C  3.475093 0.082075 -0.397638
C  -4.513645 0.682243 1.566371
C  -4.120652 0.019503 -0.749463
C  -5.549935 1.548166 1.145743
C  -5.151823 0.886031 -1.17327
C  4.855279 -0.101405 -0.680455
C  -5.872956 1.652324 -0.226505
C  5.730246 0.998699 -0.575598
C  3.828611 2.347266 0.099711
C  5.211107 2.251768 -0.173871
H  -0.301833 0.320279 1.23027
H  -1.419415 0.994418 -0.007012
H  -1.286413 -3.203927 0.349165
H  -0.208476 -2.264864 1.441998
H  -0.065288 0.044964 -1.838088
H  1.00055 1.012752 -0.737563
H  1.142772 -3.181908 -0.429837
H  0.001459 -2.481182 -1.633574
H  -2.427658 -0.829769 2.142287
H  -3.140345 -2.095565 1.104685
H  -4.262112 0.611019 2.632327
H  -3.546117 -0.570773 -1.472117
H  -6.098698 2.142824 1.885057
H  -5.395222 0.964294 -2.239294
H  5.199107 -1.101994 -0.953788
H  -6.673665 2.324636 -0.555068
H  6.796319 0.881209 -0.796288
H  3.383588 3.29582 0.421366
H  5.855116 3.13072 -0.071384
