program: Gaussian 09
title: 000065945
version: EM64L-G09RevD.01
frameworkgroup: C1[X(C16H21N3)]
method: RPBEPBE
basis: SDD
operation: Freq
keyword: #pfreq=noraman
keyword: PBEPBE/SDD
title: #p freq=noraman PBEPBE/SDD
converged: YES YES NO NO
title: Mulliken charges:
elementType: N N N C C C C C C C C C C C C C C C C H H H H H H H H H H H H H H H H H H H H H
charge: -0.255801 -0.456177 -0.121507 0.334278 -0.643645 0.075198 -0.451123 0.289353 -0.392920 0.172461 0.260876 -0.548479 -0.379166 -0.461813 -0.435782 -0.386322 -0.227753 -0.494126 -0.706629 0.248923 0.244539 0.222039 0.201931 0.230461 0.221062 0.236830 0.229268 0.201668 0.243110 0.240046 0.324217 0.234973 0.224356 0.218168 0.215744 0.226764 0.226850 0.206435 0.217651 0.214041
chargesum: 0.00000
title: Mulliken charges with hydrogens summed into heavy atoms:
elementType: N N N C C C C C C C C C C C C C C C C
charge: -0.255801 -0.131960 -0.121507 0.334278 -0.150183 0.075198 -0.027153 0.289353 0.058603 0.172461 0.260876 -0.082381 0.065611 -0.221767 -0.200809 0.056202 -0.012009 -0.040512 -0.068503
polarizability: 2.29835623e+02 3.96225101e-01 1.55255175e+02 -1.23810033e+01 8.99742220e+00 1.73420387e+02
1716.lowfreq: -17.4260 -13.6922 -8.9721 0.0003 0.0006 0.0009 36.3155 46.3203 57.9186
frequency: 36.2943 46.2767 57.8396 72.2032 81.2789 93.4818 96.1010 153.0413 186.9041 198.8516 224.9165 234.9159 253.9590 275.7351 283.7714 310.7865 324.9237 375.8198 434.0082 442.3834 471.0476 521.4781 531.4609 565.1223 584.5002 594.1311 667.5971 675.5261 707.1732 726.5915 733.8278 746.4036 756.8672 791.8735 826.0318 836.9320 852.2515 877.6964 888.5585 899.2514 908.7691 928.3577 934.0708 942.3584 949.1035 970.2151 986.3635 1005.5575 1024.5348 1033.5542 1043.4648 1052.3254 1077.6861 1088.7627 1112.0151 1124.7142 1155.6044 1158.7605 1164.5661 1166.1085 1171.4898 1178.1688 1210.6919 1212.5183 1222.5957 1244.0979 1255.2415 1262.1656 1272.8754 1275.6218 1284.0853 1288.9031 1294.5148 1319.3998 1349.7215 1361.0383 1385.4317 1394.1484 1435.8514 1450.6320 1456.5940 1458.2735 1468.8018 1472.4995 1473.0210 1474.9684 1475.6260 1484.5608 1498.3896 1506.7582 1570.9708 1604.6510 1661.4040 2946.3912 2969.4913 2969.9023 2975.0750 2987.2866 2988.4447 2988.7375 3001.9788 3023.7554 3033.4222 3052.9626 3058.2057 3058.6834 3069.5925 3070.7461 3072.7000 3073.5309 3122.0726 3132.5429 3155.7479 3570.2488
redmass: 3.8911 3.1510 3.2064 2.9853 2.5647 2.5968 2.3339 2.1404 3.9119 2.7658 1.2258 2.7106 3.2758 4.1136 2.9737 2.5212 3.4854 4.5936 1.8183 1.8287 3.1534 3.2433 3.3675 5.5599 3.9809 4.8250 4.2366 4.4301 3.0083 4.3802 2.5750 1.5750 1.2231 2.4617 1.2832 2.1791 1.9653 2.4481 2.3201 1.6236 2.6187 3.2080 2.7178 2.2730 1.5455 4.0425 3.5787 2.5560 2.0443 3.2110 1.7587 2.9683 1.6492 3.9394 2.0417 1.6800 1.8897 1.2864 1.1395 1.3482 1.4944 2.0344 2.1583 1.1509 1.4787 1.4367 1.3212 1.3316 1.5083 1.5216 1.3271 1.5773 1.2398 1.4949 1.5957 1.9737 1.2117 4.9379 2.0535 1.1156 1.1871 1.1195 1.1083 1.3330 1.3665 2.3870 1.0863 1.0737 1.6588 1.1202 6.6948 8.2086 9.3673 1.0693 1.0589 1.0377 1.0621 1.0646 1.0607 1.0651 1.0658 1.0992 1.0947 1.1017 1.0964 1.1052 1.0980 1.0986 1.0979 1.1014 1.0861 1.0922 1.0975 1.0810
irintensity: 0.8702 0.9228 0.3287 0.7427 2.3986 0.8833 0.7638 2.3645 14.5684 6.3501 0.0571 4.0187 5.9855 1.2050 0.7031 5.6874 6.6106 12.3848 27.5763 49.2544 2.8615 4.4670 5.1994 1.0684 8.7715 6.7158 2.9033 0.0812 2.3341 3.6205 9.7865 6.6444 72.4046 1.1285 1.7366 4.8977 1.0777 1.5077 1.1929 0.3793 11.3495 16.7204 6.1179 7.7479 3.7357 8.3137 2.4155 4.6482 13.0682 12.4325 7.6130 1.9508 0.6217 17.2716 14.4308 25.0310 7.0239 17.9684 2.3865 3.0781 0.7187 6.0338 6.1151 0.9447 18.8525 1.9250 10.2978 21.8543 35.4830 3.7413 26.6248 44.5215 5.5420 8.2678 6.1828 3.3529 9.9721 18.1479 51.2786 2.0236 19.5902 19.1969 0.6552 17.0879 16.4829 30.0555 4.7470 12.5438 59.2200 9.5981 98.8889 71.9104 3.2106 55.6134 91.2314 27.1707 11.9094 47.0512 35.5387 25.3794 63.2775 36.9192 2.0642 0.5871 14.3768 56.4161 0.7365 61.7104 46.0977 70.3016 0.3188 21.0195 39.0614 51.3613
temp: 298.150 k
press: 1.00000 atm
elementType: 7 7 7 6 6 6 6 6 6 6 6 6 6 6 6 6 6 6 6 1 1 1 1 1 1 1 1 1 1 1 1 1 1 1 1 1 1 1 1 1
symmnumber: 1
zpe: 891588.4 jmol-1
zpe.correction: 0.339588 hartree
zpe.thermalcorrener: 0.357196 hartree
zpe.thermalcorrenthalpy: 0.358141 hartree
zpe.thermalcorrgfe: 0.293641 hartree
zpe.sumelectzpe: -785.122061 hartree
zpe.sumelectthermal: -785.104452 hartree
zpe.sumelectthermalent: -785.103508 hartree
zpe.sumelectthermalfe: -785.168008 hartree
dipole: 1.2725 1.9265 -0.6085
dipole: 2.3876
quadrupole: -118.4375 -109.0806 -107.0125
quadrupole: 3.8590 4.0777 0.1921
quadrupole: -6.9273 2.4296 4.4977 3.8590 4.0777 0.1921
hfenergy: -785.4616487 hartree
pointgroup: C01 [X(C16H21N3)]
dipole: -0.3951689 0.7949093 0.3072104 debye
polarizability: 228.003362|-8.8607407|157.7421528|-15.142169|-8.3761766|172.7656707 unknown
InChI: InChI=1S/C16H21N3/c1-2-7-16(15-17-8-9-18-15)11-13-5-3-4-12-6-10-19(16)14(12)13/h3-5,17H,2,6-11H2,1H3
charge 0 multiplicity 1
40 atoms
N  -0.345726 -0.505751 -1.024119
N  0.609422 1.649504 1.058093
N  2.46484 1.30162 -0.254482
C  0.840866 -0.624601 -0.071741
C  0.142386 -1.283486 1.21217
C  -1.488939 -0.445426 -0.227723
C  1.94792 -1.510695 -0.680048
C  -1.329096 -0.861876 1.09718
C  -0.568813 0.468287 -2.143248
C  1.35539 0.787888 0.246402
C  -2.600658 0.173516 -0.804721
C  -2.152361 0.585177 -2.215747
C  3.101476 -1.872139 0.283115
C  -2.466262 -0.738619 1.924285
C  -3.736219 0.29557 0.024477
C  1.23852 2.989189 1.087465
C  -3.660603 -0.178533 1.371454
C  2.555766 2.713473 0.265366
C  4.149346 -2.778933 -0.397509
H  0.634944 -0.969623 2.147611
H  0.238967 -2.3841 1.133698
H  2.375035 -0.985853 -1.555255
H  1.457316 -2.433673 -1.047193
H  -0.134968 0.107277 -3.089664
H  -0.115008 1.454096 -1.902533
H  -2.545984 -0.120843 -2.97301
H  -2.469943 1.600568 -2.510447
H  2.70252 -2.385501 1.181306
H  3.585206 -0.93872 0.624248
H  -2.44701 -1.039377 2.978385
H  -0.321757 1.438718 1.416021
H  -4.660224 0.76678 -0.330593
H  1.448915 3.317405 2.121974
H  0.593964 3.751299 0.606349
H  -4.542351 -0.080045 2.014691
H  2.673004 3.411523 -0.582269
H  3.458008 2.80398 0.898129
H  3.695647 -3.727313 -0.743905
H  4.589271 -2.275366 -1.278707
H  4.974591 -3.031095 0.293695
