program: Orca
programVersion: 5.0.2
elementType: Cl Cl S P O O O C C C C C C C C C H H H H H H H H H H H
charge: 0
multiplicity: 1
keywords: wb97x-d3
keywords: def2-TZVPP
keywords: def2/J RIJCOSX
keywords: DEFGRID2
keywords: scfconv7
keywords: smallprint printgap noloewdin
keywords: NOSOSCF
formula: C9H11Cl2O3PS
InChI: InChI=1/C9H11Cl2O3PS/c1-6-4-7(10)9(8(11)5-6)14-15(16,12-2)13-3/h4-5H,1-3H3
27 atoms
Cl 1.076468 -1.988222 1.470275
Cl 0.242357 1.821314 -2.212552
S  -2.817929 -1.978002 0.294964
P  -1.788986 -0.373851 0.15046
O  -0.392739 -0.612723 -0.658384
O  -2.482318 0.844237 -0.607036
O  -1.265993 0.338165 1.46633
C  0.793502 -0.021835 -0.33426
C  3.298337 1.098248 0.251236
C  1.618878 -0.582723 0.63521
C  1.237637 1.112771 -0.996763
C  2.85603 -0.038444 0.923549
C  2.476308 1.667598 -0.712957
C  4.648544 1.674421 0.553199
C  -3.13704 0.645509 -1.865351
C  -1.938524 0.222284 2.725239
H  3.479939 -0.497769 1.679494
H  2.79899 2.551989 -1.246655
H  4.77872 2.650232 0.089002
H  4.799643 1.786254 1.626789
H  5.44072 1.021837 0.182975
H  -3.474021 1.622506 -2.196333
H  -3.995414 -0.015107 -1.753237
H  -2.456387 0.232071 -2.608223
H  -2.887363 0.755337 2.707683
H  -1.284346 0.675075 3.464548
H  -2.107861 -0.821032 2.984984
elementType: Cl S P O C H
totalener: -2235.39417251 hartree
nucrepener: 1756.96483283 hartree
electener: -3992.35900534 hartree
oneelecener: -6576.38354519 hartree
twoeener: 2584.02453985 hartree
cpcmener: -0.01953507 hartree
kineticenergy: 2230.20124697 hartree
xcener: -132.853223649490 hartree
chargesum: -0.0000000
charge: -0.070935 -0.070094 -0.429944 0.735636 -0.359567 -0.336526 -0.323014 0.226182 -0.029996 0.038691 0.035336 -0.151098 -0.158238 -0.190097 -0.124736 -0.114544 0.132373 0.131433 0.096059 0.103952 0.107066 0.136278 0.119892 0.118547 0.135585 0.130189 0.111569
qa: -0.0709 -0.0701 -0.4299 0.7356 -0.3596 -0.3365 -0.3230 0.2262 -0.0300 0.0387 0.0353 -0.1511 -0.1582 -0.1901 -0.1247 -0.1145 0.1324 0.1314 0.0961 0.1040 0.1071 0.1363 0.1199 0.1185 0.1356 0.1302 0.1116
va: 1.2461 1.2429 2.0240 5.4874 2.0992 2.0842 2.0706 3.8000 3.7984 3.8975 3.9608 4.0062 4.0120 3.8803 3.8354 3.8270 1.0130 1.0142 1.0059 0.9979 0.9947 0.9880 1.0044 0.9918 0.9877 0.9891 1.0017
dispcorr: -0.014009816 hartree
energy: -2235.408182321871
dipole: 5.02460 -3.72698 1.29762 9.79782 -7.99541 1.80241 5.25473 -4.72254 0.53219
magnitude: 2.28379 au
magnitude: 5.80494 debye
