program: Gaussian 09
title: 000065926
version: EM64L-G09RevD.01
frameworkgroup: C1[X(C12H16N2O)]
method: RPBEPBE
basis: SDD
operation: Freq
keyword: #p
keyword: freq=noraman
keyword: PBEPBE/SDD
title: #p freq=noraman PBEPBE/SDD
converged: YES YES NO NO
title: Mulliken charges:
elementType: O N N C C C C C C C C C C C C H H H H H H H H H H H H H H H H
charge: -0.269945 -0.139435 -0.583544 -0.075655 -0.394994 -0.552344 0.181913 -0.453029 -0.546032 0.504979 -0.438477 -0.368825 -0.218920 -0.230704 -0.242292 0.225645 0.221153 0.273467 0.244327 0.237039 0.226949 0.206024 0.216210 0.262069 0.286121 0.264064 0.229648 0.255604 0.224948 0.226169 0.227867
chargesum: 0.00000
title: Mulliken charges with hydrogens summed into heavy atoms:
elementType: O N N C C C C C C C C C C C C
charge: -0.269945 -0.139435 -0.033359 0.149990 0.099625 -0.070978 0.181913 -0.020055 -0.067752 0.504979 -0.208829 -0.113221 0.006028 -0.004534 -0.014425
polarizability: 1.59283862e+02 2.25300421e+01 1.20730564e+02 -6.28579547e+00 -1.06576710e+00 1.30896623e+02
1716.lowfreq: -13.7084 -9.2863 -1.8581 0.0003 0.0004 0.0004 13.7939 25.8110 38.9917
frequency: 7.4389 25.7486 38.5430 81.0772 110.2461 128.4084 196.3227 215.3169 219.1881 256.8201 292.1334 344.5333 347.8934 402.6037 424.6111 467.5037 505.4577 542.8011 582.5712 597.7909 616.0801 647.7718 681.0835 705.4133 750.9398 788.4482 810.2829 829.4525 855.2833 883.0628 905.6179 921.9791 946.4327 977.7487 984.4473 989.8589 996.0610 1024.0400 1030.6981 1035.4998 1075.6413 1088.8402 1099.0592 1123.3467 1154.6024 1171.6606 1179.4716 1186.4508 1207.7948 1214.8231 1235.1300 1265.8812 1270.9728 1290.0645 1306.7620 1326.7785 1334.8452 1356.2037 1371.3427 1383.0250 1403.8382 1442.0175 1450.8968 1456.6836 1476.8401 1483.4361 1505.7783 1595.2755 1613.9835 1632.5890 1642.0211 2892.3705 2958.7669 2976.6959 3004.3624 3013.9203 3033.4399 3035.7348 3049.4979 3071.3350 3113.9923 3121.3278 3133.4462 3144.5825 3161.7786 3476.5733 3604.6857
redmass: 3.9208 4.4612 4.0064 4.0587 4.6130 2.1355 2.2661 1.9301 3.1038 2.4521 4.3613 2.0178 2.2697 2.8107 3.2001 3.1293 3.2905 3.2606 1.3405 4.4048 6.1556 4.6374 4.8435 1.7560 2.0896 3.4637 3.5000 2.5384 1.2484 1.8912 1.5629 1.5011 1.8993 1.4006 1.7918 5.3695 1.3531 2.4125 1.6536 2.4032 1.7480 1.6101 3.1397 1.3721 1.2977 1.0575 1.7382 1.1173 2.1817 1.8962 1.5879 1.4275 1.9512 1.6128 1.3761 1.3269 1.3952 1.3908 1.4184 5.8023 2.5880 2.1073 1.0912 1.1248 1.0875 2.2054 1.1075 6.0853 6.0485 9.7948 1.0953 1.0701 1.0661 1.0595 1.0692 1.0812 1.0885 1.1019 1.0975 1.1005 1.0871 1.0862 1.0914 1.0962 1.1015 1.0452 1.0983
irintensity: 0.2012 1.6611 0.6718 2.5169 3.3390 3.9862 2.7284 21.4685 12.7078 1.9176 12.2434 2.2132 3.3241 0.1637 12.1650 13.7106 6.3541 1.6776 186.2430 18.3559 1.6711 22.1362 4.5657 60.5125 28.6465 5.3135 9.8984 6.2046 0.0530 1.2387 3.5608 5.5247 11.0470 0.2066 8.7828 0.2473 0.6552 2.3161 19.6494 2.8458 3.2170 17.1150 20.7097 3.1545 21.4023 0.4776 9.2945 0.6028 3.8819 7.0255 24.4463 19.5886 99.5965 7.1399 3.5091 2.9580 10.8960 9.7602 4.0473 14.2580 48.7150 6.6076 11.0409 25.9744 5.1954 11.8816 9.5529 0.6032 5.4831 333.4054 40.7326 93.7951 46.6088 49.7200 19.5044 3.5227 71.0461 12.3022 17.2983 14.2118 8.4448 0.4537 12.7562 38.5286 24.0203 0.5891 2.6242
temp: 298.150 k
press: 1.00000 atm
elementType: 8 7 7 6 6 6 6 6 6 6 6 6 6 6 6 1 1 1 1 1 1 1 1 1 1 1 1 1 1 1 1
symmnumber: 1
zpe: 683700.4 jmol-1
zpe.correction: 0.260408 hartree
zpe.thermalcorrener: 0.274673 hartree
zpe.thermalcorrenthalpy: 0.275617 hartree
zpe.thermalcorrgfe: 0.216136 hartree
zpe.sumelectzpe: -650.491374 hartree
zpe.sumelectthermal: -650.477109 hartree
zpe.sumelectthermalent: -650.476164 hartree
zpe.sumelectthermalfe: -650.535645 hartree
dipole: -0.4826 4.4967 -1.7354
dipole: 4.8441
quadrupole: -80.5092 -94.7111 -85.2603
quadrupole: -6.1635 2.7464 9.2401
quadrupole: 6.3177 -7.8842 1.5666 -6.1635 2.7464 9.2401
hfenergy: -650.7517813 hartree
pointgroup: C01 [X(C12H16N2O1)]
dipole: 0.3947584 -1.8637286 -0.0525718 debye
polarizability: 154.0490406|26.3732906|127.7595657|0.1670976|5.7198102|129.1024431 unknown
InChI: InChI=1S/C12H16N2O/c13-7-11-6-12(15)14(9-11)8-10-4-2-1-3-5-10/h1-5,11H,6-9,13H2
charge 0 multiplicity 1
31 atoms
O  1.390927 2.834246 0.219981
N  0.978437 0.756006 -0.819201
N  2.098457 -2.724253 1.007158
C  2.797657 -0.552438 -0.007379
C  1.639733 -0.545144 -1.048447
C  3.060431 0.951908 0.272004
C  1.739685 1.654977 -0.082931
C  2.371471 -1.303164 1.281887
C  -0.338576 1.097536 -1.372469
C  -1.484023 0.337695 -0.707138
C  -2.345823 -0.494416 -1.460985
C  -1.70372 0.470474 0.688643
C  -3.412136 -1.183302 -0.836083
C  -2.766215 -0.215567 1.315243
C  -3.624642 -1.045798 0.55415
H  3.690229 -1.052181 -0.427063
H  2.012975 -0.611642 -2.091592
H  0.955623 -1.392929 -0.866561
H  3.863136 1.367183 -0.366005
H  3.332363 1.165996 1.320271
H  1.439931 -0.844383 1.667104
H  3.156843 -1.136673 2.057188
H  -0.340801 0.906698 -2.463867
H  -0.454197 2.187299 -1.212812
H  1.453205 -3.179866 1.656156
H  2.929533 -3.291497 0.817956
H  -2.183657 -0.604235 -2.540911
H  -1.044568 1.123464 1.273623
H  -4.072446 -1.824347 -1.431239
H  -2.932097 -0.098793 2.392398
H  -4.451034 -1.576754 1.040122
