program: Orca
programVersion: 5.0.2
elementType: Cl Cl S P O O O C C C C C C C C C H H H H H H H H H H H
charge: 0
multiplicity: 1
keywords: wb97x-d3
keywords: def2-TZVPP
keywords: def2/J RIJCOSX
keywords: DEFGRID2
keywords: scfconv7
keywords: smallprint printgap noloewdin
keywords: NOSOSCF
formula: C9H11Cl2O3PS
InChI: InChI=1/C9H11Cl2O3PS/c1-6-4-7(10)9(8(11)5-6)14-15(16,12-2)13-3/h4-5H,1-3H3
27 atoms
Cl 0.678494 -1.596992 -2.161706
Cl 0.616535 2.346631 1.477427
S  -3.226468 1.409978 0.143185
P  -1.835278 0.100301 0.131395
O  -0.501424 0.644605 -0.627417
O  -1.216817 -0.403744 1.50272
O  -2.186792 -1.283728 -0.576042
C  0.778748 0.32347 -0.280287
C  3.458925 -0.215473 0.344376
C  1.469859 -0.688461 -0.930275
C  1.450457 1.064545 0.685547
C  2.795572 -0.954355 -0.627331
C  2.771982 0.804659 0.996094
C  4.883785 -0.513587 0.696648
C  -2.051986 -0.691456 2.632517
C  -2.902391 -1.314759 -1.816726
H  3.314518 -1.743637 -1.155137
H  3.271265 1.399934 1.749524
H  4.939112 -1.124562 1.599192
H  5.386022 -1.058256 -0.100818
H  5.44345 0.400671 0.890808
H  -2.590095 0.19985 2.952691
H  -1.389522 -1.01851 3.428649
H  -2.761227 -1.486738 2.405626
H  -2.358422 -0.79365 -2.603854
H  -3.89044 -0.869622 -1.704819
H  -3.00763 -2.360724 -2.089186
elementType: Cl S P O C H
totalener: -2235.39482339 hartree
nucrepener: 1753.15512472 hartree
electener: -3988.54994812 hartree
oneelecener: -6568.81635099 hartree
twoeener: 2580.26640288 hartree
cpcmener: -0.01988350 hartree
kineticenergy: 2230.20205377 hartree
xcener: -132.852628940983 hartree
chargesum: 0.0000000
charge: -0.069086 -0.069549 -0.430152 0.732795 -0.358272 -0.315711 -0.334202 0.223136 -0.027800 0.033759 0.034622 -0.155953 -0.146407 -0.190420 -0.122299 -0.122077 0.130251 0.130582 0.107722 0.097750 0.101366 0.115283 0.129640 0.130347 0.119538 0.119559 0.135579
qa: -0.0691 -0.0695 -0.4302 0.7328 -0.3583 -0.3157 -0.3342 0.2231 -0.0278 0.0338 0.0346 -0.1560 -0.1464 -0.1904 -0.1223 -0.1221 0.1303 0.1306 0.1077 0.0977 0.1014 0.1153 0.1296 0.1303 0.1195 0.1196 0.1356
va: 1.2438 1.2479 2.0257 5.4924 2.1093 2.0785 2.0807 3.8098 3.7951 3.9623 3.8951 4.0145 4.0031 3.8812 3.8426 3.8309 1.0142 1.0139 0.9942 1.0037 0.9995 0.9981 0.9897 0.9873 0.9907 1.0056 0.9884
dispcorr: -0.013848707 hartree
energy: -2235.408672100483
dipole: 6.31518 -4.75907 1.55611 -9.61035 7.89038 -1.71996 5.50456 -4.91444 0.59013
magnitude: 2.39333 au
magnitude: 6.08335 debye
