program: Orca
programVersion: 5.0.2
elementType: Cl Cl S P O O O C C C C C C C C C H H H H H H H H H H H
charge: 0
multiplicity: 1
keywords: wb97x-d3
keywords: def2-TZVPP
keywords: def2/J RIJCOSX
keywords: DEFGRID2
keywords: scfconv7
keywords: smallprint printgap noloewdin
keywords: NOSOSCF
formula: C9H11Cl2O3PS
InChI: InChI=1/C9H11Cl2O3PS/c1-6-4-7(10)9(8(11)5-6)14-15(16,12-2)13-3/h4-5H,1-3H3
27 atoms
Cl 0.916518 -2.556168 -0.173596
Cl 0.284598 2.753396 -0.681109
S  -1.325342 0.182188 2.121166
P  -1.78323 -0.268352 0.322033
O  -0.568021 -0.051246 -0.760328
O  -2.242615 -1.769727 0.128395
O  -2.976182 0.509627 -0.384311
C  0.735225 0.118302 -0.40443
C  3.449918 0.498227 0.209376
C  1.564587 -0.961095 -0.127055
C  1.287183 1.392925 -0.351114
C  2.903773 -0.779366 0.172202
C  2.624825 1.585951 -0.055404
C  4.90674 0.699039 0.492548
C  -2.559228 -2.344903 -1.151925
C  -3.128617 1.93333 -0.340286
H  3.524905 -1.640151 0.382663
H  3.026343 2.590557 -0.026075
H  5.475092 0.751234 -0.437873
H  5.083066 1.627813 1.033262
H  5.314996 -0.122186 1.079258
H  -3.473322 -2.92013 -1.029527
H  -1.75065 -3.00702 -1.452461
H  -2.717222 -1.598298 -1.9283
H  -2.698546 2.357041 0.567134
H  -4.196219 2.136813 -0.351765
H  -2.665424 2.3844 -1.214952
elementType: Cl S P O C H
totalener: -2235.39543585 hartree
nucrepener: 1761.50594845 hartree
electener: -3996.90138430 hartree
oneelecener: -6585.57125427 hartree
twoeener: 2588.66986997 hartree
cpcmener: -0.02028287 hartree
kineticenergy: 2230.18681477 hartree
xcener: -132.852188870146 hartree
chargesum: -0.0000000
charge: -0.069439 -0.067835 -0.413347 0.704983 -0.358498 -0.338218 -0.325460 0.212939 -0.021000 0.055614 0.057780 -0.162513 -0.162472 -0.189222 -0.092953 -0.105538 0.131536 0.131022 0.107414 0.100809 0.098939 0.129781 0.105026 0.114888 0.103503 0.132965 0.119297
qa: -0.0694 -0.0678 -0.4133 0.7050 -0.3585 -0.3382 -0.3255 0.2129 -0.0210 0.0556 0.0578 -0.1625 -0.1625 -0.1892 -0.0930 -0.1055 0.1315 0.1310 0.1074 0.1008 0.0989 0.1298 0.1050 0.1149 0.1035 0.1330 0.1193
va: 1.2478 1.2472 2.0266 5.5170 2.0543 2.1010 2.0893 3.7405 3.7897 3.9376 3.9310 4.0186 4.0232 3.8801 3.8479 3.8335 1.0132 1.0139 0.9943 1.0012 1.0030 0.9909 0.9953 0.9937 1.0062 0.9920 0.9900
dispcorr: -0.014561688 hartree
energy: -2235.409997536736
dipole: 4.57997 -3.72510 0.85487 2.08617 -1.68276 0.40340 -2.59594 0.97646 -1.61948
magnitude: 1.87517 au
magnitude: 4.76629 debye
