program: Gaussian 09
title: 000065932
version: EM64L-G09RevD.01
frameworkgroup: C1[X(C11H12N2O2)]
method: RPBEPBE
basis: SDD
operation: Freq
keyword: #p
keyword: freq=noraman
keyword: PBEPBE/SDD
title: #p freq=noraman PBEPBE/SDD
converged: YES YES NO NO
title: Mulliken charges:
elementType: O O N N C C C C C C C C C C C H H H H H H H H H H H H
charge: -0.429228 -0.457952 -0.404390 -0.070355 -0.635237 0.385727 -0.045759 0.283821 0.364941 -0.423802 -0.341220 -0.254724 -0.487770 -0.428751 -0.236401 0.239737 0.247599 0.231377 0.240269 0.226982 0.229409 0.188169 0.310894 0.283742 0.262622 0.377685 0.342614
chargesum: 0.00000
title: Mulliken charges with hydrogens summed into heavy atoms:
elementType: O O N N C C C C C C C C C C C
charge: -0.051543 -0.115338 -0.093497 -0.070355 -0.147901 0.385727 -0.045759 0.283821 0.364941 -0.192425 -0.100951 -0.027742 -0.070191 -0.145009 0.026222
polarizability: 1.74851602e+02 -8.54196374e+00 1.33111301e+02 -1.39549145e+01 -2.56808166e+00 9.71359046e+01
1716.lowfreq: -31.3890 -7.6059 -0.0007 -0.0005 -0.0003 2.5456 7.7841 38.9210 53.1594
frequency: -31.1928 38.9015 53.0850 61.6285 117.9770 172.1301 183.4529 218.8078 250.5331 262.8087 287.6604 311.1801 357.7916 470.3634 477.4007 507.8399 539.6860 570.8526 579.4856 616.8814 648.3708 664.4056 694.1979 711.9286 753.8081 784.5985 794.7749 822.1872 844.5933 892.3148 907.2170 916.2032 939.3115 944.2233 970.2952 988.8797 1003.8019 1080.8926 1087.9806 1105.2550 1161.3572 1172.6476 1181.2205 1187.7649 1202.8895 1207.2271 1230.1641 1251.7273 1261.5949 1294.0625 1309.6468 1357.0766 1362.5907 1391.7908 1404.6988 1430.6641 1450.8598 1463.7854 1471.2860 1475.9801 1550.9448 1605.7028 1619.7793 2949.2151 2958.4776 3010.2591 3039.0600 3119.5391 3134.7001 3162.4561 3230.0870 3240.0284 3428.8342 3548.9341 3577.7068
redmass: 3.3725 3.8851 5.0304 6.0040 6.3087 1.5703 2.5981 4.8367 4.5622 2.1352 4.9782 3.3350 5.0529 3.2496 1.6311 2.0456 3.6817 5.5278 5.3209 3.7903 2.5680 1.3057 4.4172 4.7945 2.0574 1.4157 1.9654 4.9760 1.3182 5.1651 1.6156 3.4088 2.5069 2.3438 1.3905 3.6028 2.1458 2.0003 2.0571 2.0480 1.2308 1.4223 1.3206 2.1223 1.3183 1.3509 1.5595 1.5584 1.6555 2.4718 1.4644 2.0949 4.1877 3.6953 1.5139 2.9769 1.9275 1.3975 1.6980 1.6755 4.0406 6.5635 6.9151 1.0637 1.0625 1.0951 1.1002 1.0883 1.0904 1.0989 1.0972 1.1005 1.0657 1.0665 1.0819
irintensity: 1.5360 3.4459 5.6380 4.0831 2.0003 82.9563 64.6469 7.0695 7.0376 1.9660 1.2373 3.5194 0.6140 1.0975 59.4123 24.5332 0.7264 6.5116 15.0483 3.6446 74.5555 45.2502 4.4818 5.5297 30.6816 22.7219 59.6947 14.8915 26.8838 15.4418 12.8443 11.3635 23.0249 41.8458 0.7067 14.2729 10.5532 47.9205 12.9198 14.3772 21.1499 56.1577 5.0613 49.4097 19.7938 2.5455 4.3786 14.7297 8.7835 8.9954 36.7512 14.1724 4.9382 10.0772 11.9579 25.5782 25.8663 32.1420 2.6671 20.4971 15.3410 13.2521 10.7363 27.5906 76.4632 11.1437 18.2058 7.4196 14.2014 25.0211 4.5582 1.3859 281.0208 4.7296 38.8605
temp: 298.150 k
press: 1.00000 atm
elementType: 8 8 7 7 6 6 6 6 6 6 6 6 6 6 6 1 1 1 1 1 1 1 1 1 1 1 1
symmnumber: 1
zpe: 556732.9 jmol-1
zpe.correction: 0.212048 hartree
zpe.thermalcorrener: 0.224923 hartree
zpe.thermalcorrenthalpy: 0.225867 hartree
zpe.thermalcorrgfe: 0.171765 hartree
zpe.sumelectzpe: -685.209436 hartree
zpe.sumelectthermal: -685.196561 hartree
zpe.sumelectthermalent: -685.195617 hartree
zpe.sumelectthermalfe: -685.249719 hartree
dipole: 1.9940 1.1294 -2.3994
dipole: 3.3179
quadrupole: -81.6406 -80.3588 -90.0109
quadrupole: 6.4062 -23.5956 0.1644
quadrupole: 2.3628 3.6447 -6.0074 6.4062 -23.5956 0.1644
hfenergy: -685.4214845 hartree
pointgroup: C01 [X(C11H12N2O2)]
dipole: 0.7412345 -0.0678741 -1.0723656 debye
polarizability: 169.9793825|-19.4684276|129.3065748|-13.5807802|-13.0236371|105.8128506 unknown
InChI: InChI=1S/C11H12N2O2/c14-6-9-3-1-2-8(11(9)15)4-10-5-12-7-13-10/h1-3,5,7,13-15H,4,6H2
charge 0 multiplicity 1
27 atoms
O  -0.531307 -1.556571 0.199152
O  -4.075135 -1.536787 0.197903
N  3.273269 -0.943616 -0.829795
N  3.481266 -0.773952 1.413697
C  1.114412 0.33392 -1.355911
C  -0.217398 0.715832 -0.718481
C  -0.996645 -0.244326 -0.010086
C  2.139859 -0.22975 -0.39512
C  -2.28923 0.07024 0.485166
C  -0.748436 2.015368 -0.888571
C  -2.787577 1.378708 0.286479
C  -2.025601 2.354874 -0.390553
C  -3.121383 -0.97313 1.189963
C  2.297406 -0.139262 0.995794
C  4.046782 -1.246922 0.28792
H  0.928078 -0.410897 -2.159645
H  1.533258 1.229032 -1.855173
H  -0.154715 2.765193 -1.425919
H  -3.787075 1.622776 0.66439
H  -2.420937 3.365581 -0.533476
H  -2.463829 -1.766743 1.591054
H  -3.689482 -0.50525 2.021324
H  3.479826 -1.196823 -1.795934
H  1.640053 0.352793 1.709225
H  4.980883 -1.801044 0.23442
H  0.465275 -1.571947 0.185413
H  -4.444316 -2.381896 0.562863
