program: Orca
programVersion: 5.0.2
elementType: Cl Cl Cl Cl Cl O O N C C C C C C
charge: 0
multiplicity: 1
keywords: wb97x-d3
keywords: def2-TZVPP
keywords: def2/J RIJCOSX
keywords: DEFGRID2
keywords: scfconv7
keywords: smallprint printgap noloewdin
keywords: NOSOSCF
formula: C6Cl5NO2
InChI: InChI=1/C6Cl5NO2/c7-1-2(8)4(10)6(12(13)14)5(11)3(1)9
14 atoms
Cl -1.449093 2.665663 0.079614
Cl -1.447941 -2.666312 -0.07935
Cl 1.674904 -2.685306 -0.082894
Cl 1.673736 2.686004 0.083242
Cl 3.22154 0.000712 -0.000146
O  -3.229379 0.048637 -1.073208
O  -3.230011 -0.04993 1.072198
N  -2.690985 -0.0004 -0.000329
C  -1.230475 -0.000274 0.000008
C  -0.563422 1.207653 0.035521
C  -0.5629 -1.207912 -0.035371
C  0.82712 -1.208918 -0.036644
C  0.82659 1.209259 0.036808
C  1.517683 0.000323 0.000013
elementType: Cl O N C
totalener: -2734.81439889 hartree
nucrepener: 1505.66720251 hartree
electener: -4240.48160140 hartree
oneelecener: -6765.06048423 hartree
twoeener: 2524.57888282 hartree
cpcmener: -0.00680151 hartree
kineticenergy: 2730.10215943 hartree
xcener: -144.710406892059 hartree
chargesum: 0.0000000
charge: 0.006329 0.006324 -0.006272 -0.006283 -0.004160 -0.298564 -0.298555 0.405013 0.220873 -0.102717 -0.102762 0.109822 0.109918 -0.038965
qa: 0.0063 0.0063 -0.0063 -0.0063 -0.0042 -0.2986 -0.2986 0.4050 0.2209 -0.1027 -0.1028 0.1098 0.1099 -0.0390
va: 1.3422 1.3421 1.3276 1.3276 1.3310 1.9203 1.9203 4.2453 3.6436 4.1569 4.1569 3.9635 3.9633 4.0947
dispcorr: -0.007398377 hartree
energy: -2734.821797268457
dipole: -5.06371 6.37341 1.30969 -0.00099 0.00131 0.00031 -0.00065 0.00100 0.00036
magnitude: 1.30969 au
magnitude: 3.32898 debye
