program: Orca
programVersion: 5.0.2
elementType: Cl Cl Cl Cl Cl O O N C C C C C C
charge: 0
multiplicity: 1
keywords: wb97x-d3
keywords: def2-TZVPP
keywords: def2/J RIJCOSX
keywords: DEFGRID2
keywords: scfconv7
keywords: smallprint printgap noloewdin
keywords: NOSOSCF
formula: C6Cl5NO2
InChI: InChI=1/C6Cl5NO2/c7-1-2(8)4(10)6(12(13)14)5(11)3(1)9
14 atoms
Cl -1.446838 2.666161 0.080988
Cl -1.445728 -2.666751 -0.080549
Cl 1.67453 -2.684925 -0.081915
Cl 1.673423 2.685626 0.082324
Cl 3.222238 0.000704 -0.000311
O  -3.226191 0.048263 -1.076538
O  -3.22693 -0.049608 1.075386
N  -2.696609 -0.000517 -0.000384
C  -1.234295 -0.000243 0.00002
C  -0.564612 1.207102 0.035702
C  -0.564111 -1.207309 -0.035477
C  0.827052 -1.209082 -0.03618
C  0.826546 1.209447 0.036397
C  1.518892 0.000328 0.000001
totalener: -2734.80818420 hartree
nucrepener: 1505.64561297 hartree
electener: -4240.45379717 hartree
oneelecener: -6765.42618279 hartree
twoeener: 2524.97238561 hartree
kineticenergy: 2730.11785613 hartree
xcener: -144.711548602212 hartree
chargesum: -0.0000000
charge: 0.015169 0.015165 0.002660 0.002650 0.004669 -0.268634 -0.268625 0.389439 0.190900 -0.106681 -0.106711 0.091954 0.092080 -0.054036
qa: 0.0152 0.0152 0.0027 0.0027 0.0047 -0.2686 -0.2686 0.3894 0.1909 -0.1067 -0.1067 0.0920 0.0921 -0.0540
va: 1.3504 1.3504 1.3367 1.3367 1.3398 1.9486 1.9486 4.2596 3.6897 4.1360 4.1361 3.9573 3.9571 4.0818
dispcorr: -0.007398489 hartree
energy: -2734.815582685804
dipole: -5.06698 6.10496 1.03798 -0.00105 0.00129 0.00025 -0.00072 0.00102 0.00030
magnitude: 1.03798 au
magnitude: 2.63833 debye
