program: Orca
programVersion: 5.0.2
elementType: S P O O O O O N N N C C C C C C C C C C C C C C H H H H H H H H H H H H H H H H H H H H
charge: 0
multiplicity: 1
keywords: wb97x-d3
keywords: def2-TZVPP
keywords: def2/J RIJCOSX
keywords: DEFGRID2
keywords: scfconv7
keywords: smallprint printgap noloewdin
keywords: NOSOSCF
formula: C14H20N3O5PS
InChI: InChI=1/C14H20N3O5PS/c1-5-19-14(18)11-9-17-12(15-10(11)4)8-13(16-17)22-23(24,20-6-2)21-7-3/h8-9H,5-7H2,1-4H3
44 atoms
S  4.035168 -0.273193 -1.891936
P  3.348872 0.609052 -0.334649
O  1.885974 1.309216 -0.470575
O  4.090708 1.93432 0.127066
O  3.137566 -0.267136 0.972411
O  -5.089188 0.728464 0.914062
O  -5.776027 -1.10972 -0.15269
N  -1.298209 0.301572 -0.190226
N  -1.66468 -1.90996 -0.959214
N  -0.333453 1.214524 -0.030183
C  -0.838556 -0.881875 -0.73641
C  -3.455826 -0.568671 -0.107566
C  -2.587086 0.464777 0.122262
C  -2.934741 -1.785761 -0.667209
C  0.736701 0.600874 -0.48639
C  0.512341 -0.701759 -0.947375
C  -3.785013 -2.981416 -0.939806
C  -4.889397 -0.368615 0.202404
C  5.524384 2.077077 0.02309
C  3.580908 -1.628101 1.166072
C  -6.436989 1.144249 1.201478
C  6.271199 1.14956 0.948855
C  2.486846 -2.407554 1.846755
C  -7.066588 1.865696 0.033838
H  -2.862071 1.425087 0.532739
H  1.208481 -1.40436 -1.372314
H  -3.152681 -3.798959 -1.276149
H  -4.326667 -3.303947 -0.051412
H  -4.523656 -2.778395 -1.714516
H  5.712792 3.117544 0.27869
H  5.823325 1.924144 -1.015184
H  4.483186 -1.592225 1.776836
H  3.839336 -2.072829 0.204295
H  -7.034767 0.289116 1.517719
H  -6.334281 1.811801 2.054362
H  6.163413 0.10242 0.661955
H  5.94787 1.265733 1.982922
H  7.333591 1.389193 0.901186
H  1.592415 -2.470666 1.226647
H  2.217006 -1.972166 2.80867
H  2.841228 -3.422347 2.028927
H  -7.207793 1.216386 -0.829243
H  -8.047867 2.232916 0.335706
H  -6.470037 2.725583 -0.270374
elementType: S P O N C H
totalener: -1825.70426166 hartree
nucrepener: 2458.41251880 hartree
electener: -4284.11678046 hartree
oneelecener: -7393.32820105 hartree
twoeener: 3109.21142059 hartree
cpcmener: -0.03621455 hartree
kineticenergy: 1819.71176747 hartree
xcener: -138.291306068442 hartree
chargesum: -0.0000000
charge: -0.434020 0.731350 -0.315667 -0.341860 -0.333065 -0.290552 -0.482985 0.161472 -0.352807 -0.364202 0.230749 -0.123717 0.078270 0.192412 0.297232 -0.363775 -0.261995 0.504053 0.031824 0.055270 0.040860 -0.241942 -0.245414 -0.252769 0.160228 0.157056 0.095426 0.107709 0.106130 0.112798 0.098822 0.109953 0.100054 0.091952 0.110549 0.076561 0.095632 0.102548 0.090560 0.091524 0.097079 0.089800 0.097424 0.089474
qa: -0.4340 0.7314 -0.3157 -0.3419 -0.3331 -0.2906 -0.4830 0.1615 -0.3528 -0.3642 0.2307 -0.1237 0.0783 0.1924 0.2972 -0.3638 -0.2620 0.5041 0.0318 0.0553 0.0409 -0.2419 -0.2454 -0.2528 0.1602 0.1571 0.0954 0.1077 0.1061 0.1128 0.0988 0.1100 0.1001 0.0920 0.1105 0.0766 0.0956 0.1025 0.0906 0.0915 0.0971 0.0898 0.0974 0.0895
va: 1.9893 5.5127 2.1670 2.1180 2.0800 2.1311 2.0176 3.4165 3.1178 2.7970 4.0962 3.7474 4.0451 3.8701 4.1500 3.9245 3.9136 4.0937 3.8506 3.7905 3.8359 3.8892 3.9520 3.9237 1.0257 1.0147 1.0219 1.0025 1.0051 0.9925 1.0095 0.9916 1.0121 1.0102 0.9957 1.0132 1.0052 1.0087 0.9990 1.0041 1.0077 1.0117 1.0065 1.0042
dispcorr: -0.020551316 hartree
energy: -1825.724812978181
dipole: -5.84295 5.77841 -0.06454 -5.12469 5.24428 0.11960 11.24968 -9.30519 1.94448
magnitude: 1.94923 au
magnitude: 4.95454 debye
