program: Gaussian 09
title: 000065944
version: EM64L-G09RevD.01
frameworkgroup: C1[X(C9H12N2O4S)]
method: RPBEPBE
basis: SDD
operation: Freq
keyword: #p
keyword: freq=noraman
keyword: PBEPBE/SDD
title: #p freq=noraman PBEPBE/SDD
converged: YES YES NO NO
title: Mulliken charges:
elementType: S O O O O N N C C C C C C C C C H H H H H H H H H H H H
charge: 0.197147 -0.245297 -0.238693 -0.411688 -0.220173 -0.130682 -0.348866 -0.210520 -0.121799 -0.430751 0.235714 -0.521678 -0.713431 -0.649532 0.145454 0.198862 0.251839 0.330933 0.242775 0.247188 0.255194 0.260002 0.300083 0.287714 0.268809 0.307033 0.323930 0.390433
chargesum: 0.00000
title: Mulliken charges with hydrogens summed into heavy atoms:
elementType: S O O O O N N C C C C C C C C C
charge: 0.197147 -0.245297 -0.238693 -0.021255 -0.220173 -0.130682 -0.024936 0.041319 0.209134 0.059212 0.235714 -0.006482 -0.125633 -0.073690 0.145454 0.198862
polarizability: 1.71114252e+02 1.06740621e+01 1.15006469e+02 2.21366711e+00 -4.77324021e+00 1.15102324e+02
1716.lowfreq: -12.2971 -9.6649 -4.4418 -0.0017 -0.0005 0.0002 24.1968 33.5173 51.5801
frequency: 22.8193 33.2322 51.5691 55.8444 64.2762 67.9208 110.3989 149.1372 190.2418 213.6555 256.5737 292.7118 323.7646 354.8459 416.0968 446.2896 470.8433 491.1850 515.4240 567.8907 585.8571 602.5817 617.8554 632.3261 652.4559 678.5898 682.8569 702.6593 763.8080 796.4001 827.9274 848.0542 877.0034 909.8351 926.4173 945.2509 976.6866 1010.4328 1019.7075 1044.0131 1047.3427 1113.8298 1133.9659 1141.5230 1158.4785 1186.9790 1192.5729 1221.0724 1228.0942 1253.3681 1266.0564 1267.6994 1280.4944 1286.4779 1309.8847 1333.3655 1345.6331 1379.8187 1395.3618 1451.4019 1460.5657 1468.8282 1474.9276 1592.4622 1663.8306 1676.8231 2992.0392 3020.6658 3023.1672 3027.8864 3040.0703 3062.1116 3087.9862 3104.0315 3130.1858 3146.1694 3519.8128 3571.5025
redmass: 7.4035 4.3951 8.2447 9.0287 7.1563 8.8913 3.0671 5.2041 3.2741 3.3861 3.0897 4.9130 5.4863 5.2463 10.6387 4.9321 3.8803 1.6804 4.3049 3.5081 3.3430 2.4892 2.6481 2.9191 3.4525 4.3739 5.0952 4.6573 2.9633 4.2928 2.4069 3.8804 3.0553 1.9000 1.7809 2.1751 2.1027 2.3490 2.1881 2.0353 2.1559 2.1637 1.4801 1.2436 1.4151 1.2972 1.9498 1.7035 1.5496 1.7286 1.8717 1.5116 1.4094 1.3479 1.4742 1.8488 1.6806 2.5897 1.9474 1.0863 1.0886 1.0902 1.0932 10.1946 9.4214 8.8283 1.0833 1.0818 1.0611 1.0658 1.0590 1.0586 1.1022 1.1023 1.1069 1.1089 1.0643 1.0783
irintensity: 0.7474 0.6513 0.8994 2.2589 2.4915 2.8897 4.0612 4.9965 3.4336 2.7179 1.2844 7.9933 12.7517 4.5982 7.5593 22.0312 7.9451 34.2335 27.1618 65.1086 4.3701 66.1019 52.3254 61.0904 9.4541 25.4699 48.3066 10.4966 0.9204 8.8345 15.5008 8.3653 9.8256 4.8504 23.1644 3.2151 3.9020 20.9477 23.9887 82.3189 185.2749 32.1157 2.8264 34.3868 55.0554 17.0503 30.3161 23.1226 40.3477 192.1782 19.5965 26.3570 2.4133 5.4176 38.1737 65.2444 13.6146 41.9669 91.8712 8.9513 9.5307 4.6977 8.8887 219.4661 169.8730 482.9991 35.3134 22.8157 20.1401 14.3038 22.9384 15.1087 7.1044 21.1932 6.0593 2.2266 36.2773 33.0970
temp: 298.150 k
press: 1.00000 atm
elementType: 16 8 8 8 8 7 7 6 6 6 6 6 6 6 6 6 1 1 1 1 1 1 1 1 1 1 1 1
symmnumber: 1
zpe: 557770.4 jmol-1
zpe.correction: 0.212444 hartree
zpe.thermalcorrener: 0.227936 hartree
zpe.thermalcorrenthalpy: 0.228880 hartree
zpe.thermalcorrgfe: 0.166717 hartree
zpe.sumelectzpe: -1157.428380 hartree
zpe.sumelectthermal: -1157.412888 hartree
zpe.sumelectthermalent: -1157.411944 hartree
zpe.sumelectthermalfe: -1157.474107 hartree
dipole: -5.4481 -1.7339 1.8294
dipole: 6.0029
quadrupole: -123.9187 -97.6859 -100.4399
quadrupole: -16.4131 11.1841 3.4559
quadrupole: -16.5705 9.6623 6.9082 -16.4131 11.1841 3.4559
hfenergy: -1157.640824 hartree
pointgroup: C01 [X(C9H12N2O4S1)]
dipole: -2.131223 0.7491632 -0.6887952 debye
polarizability: 170.9697631|-10.946098|115.8545296|-2.5143713|-4.7997353|114.398753 unknown
InChI: InChI=1S/C9H12N2O4S/c12-7-2-1-5(10-7)8(13)11-4-16-3-6(11)9(14)15/h5-6,10,14H,1-4H2
charge 0 multiplicity 1
28 atoms
S  -2.995095 2.092769 -0.158436
O  0.596448 -0.701676 1.58357
O  4.796361 -0.474276 0.619857
O  -3.634503 -2.015732 0.045431
O  -1.947144 -1.551099 -1.485608
N  -0.881453 0.434964 0.199953
N  2.811013 0.788313 0.79844
C  1.554935 1.016408 0.090444
C  -2.02363 -0.346453 0.692805
C  1.900897 0.567077 -1.378902
C  0.399446 0.181822 0.698949
C  3.072933 -0.428556 -1.206014
C  -3.120722 0.66785 1.099884
C  -1.281675 1.456003 -0.767296
C  3.700525 -0.072762 0.153228
C  -2.494279 -1.336465 -0.38559
H  1.279121 2.088141 0.117747
H  -1.680051 -0.936673 1.563681
H  2.228312 1.449179 -1.955767
H  1.030496 0.12276 -1.888491
H  3.829435 -0.364193 -2.003665
H  2.727027 -1.476981 -1.153581
H  -4.1266 0.229649 1.045166
H  -2.923245 1.068672 2.104858
H  -0.580077 2.300051 -0.798048
H  -1.431641 1.027132 -1.770883
H  2.924194 0.995693 1.791619
H  -3.915529 -2.677318 -0.643048
