program: Orca
programVersion: 5.0.2
elementType: S P O O O O O N N N C C C C C C C C C C C C C C H H H H H H H H H H H H H H H H H H H H
charge: 0
multiplicity: 1
keywords: wb97x-d3
keywords: def2-TZVPP
keywords: def2/J RIJCOSX
keywords: DEFGRID2
keywords: scfconv7
keywords: smallprint printgap noloewdin
keywords: NOSOSCF
formula: C14H20N3O5PS
InChI: InChI=1/C14H20N3O5PS/c1-5-19-14(18)11-9-17-12(15-10(11)4)8-13(16-17)22-23(24,20-6-2)21-7-3/h8-9H,5-7H2,1-4H3
44 atoms
S  3.298093 1.337366 -1.183012
P  3.367645 -0.051046 0.13331
O  2.051476 -1.010908 0.210764
O  3.496468 0.374134 1.657158
O  4.489254 -1.162153 -0.007246
O  -5.886287 -0.041936 -0.439204
O  -4.984152 -1.997682 -1.000096
N  -1.268859 -0.686794 -0.093709
N  -2.104983 1.368656 0.73557
N  -0.131984 -1.36841 -0.268048
C  -1.075034 0.550869 0.491839
C  -3.565034 -0.291899 -0.179516
C  -2.492265 -1.108496 -0.419872
C  -3.319624 0.992902 0.420527
C  0.781186 -0.556931 0.220943
C  0.282481 0.65476 0.713955
C  -4.39438 1.981995 0.735168
C  -4.873646 -0.866601 -0.577878
C  4.254127 1.536797 2.065286
C  4.918544 -1.669461 -1.293587
C  -7.203754 -0.504803 -0.794306
C  5.74013 1.35666 1.881305
C  6.196585 -1.000687 -1.728838
C  -8.16351 0.631761 -0.555447
H  -2.566404 -2.090274 -0.865005
H  0.810815 1.477998 1.163142
H  -5.13739 1.570553 1.417214
H  -3.945332 2.85381 1.203994
H  -4.919155 2.308551 -0.161891
H  4.00344 1.669249 3.11557
H  3.89022 2.408396 1.518404
H  4.130472 -1.537698 -2.036982
H  5.061207 -2.738734 -1.148119
H  -7.210914 -0.810746 -1.841641
H  -7.460102 -1.371066 -0.182277
H  6.023911 1.296859 0.829867
H  6.10455 0.467269 2.39446
H  6.250181 2.221155 2.306698
H  6.986687 -1.129127 -0.989178
H  6.051437 0.064253 -1.906409
H  6.533801 -1.454169 -2.661185
H  -9.16966 0.304448 -0.815968
H  -8.173926 0.938703 0.490365
H  -7.925343 1.49813 -1.172322
elementType: S P O N C H
totalener: -1825.70575035 hartree
nucrepener: 2428.26105491 hartree
electener: -4253.96680526 hartree
oneelecener: -7333.36639942 hartree
twoeener: 3079.39959416 hartree
cpcmener: -0.03636175 hartree
kineticenergy: 1819.70408918 hartree
xcener: -138.287315266925 hartree
chargesum: -0.0000000
charge: -0.432231 0.758323 -0.316863 -0.350768 -0.347428 -0.269957 -0.496937 0.157064 -0.347684 -0.358713 0.202079 -0.117209 0.094844 0.191096 0.275903 -0.316035 -0.261550 0.496835 0.038252 0.051833 0.028810 -0.236597 -0.247695 -0.260660 0.149366 0.161045 0.109620 0.096803 0.108593 0.113460 0.096534 0.092920 0.108569 0.101554 0.103972 0.075855 0.094626 0.101075 0.092053 0.078291 0.102350 0.097491 0.090209 0.090903
qa: -0.4322 0.7583 -0.3169 -0.3508 -0.3474 -0.2700 -0.4969 0.1571 -0.3477 -0.3587 0.2021 -0.1172 0.0948 0.1911 0.2759 -0.3160 -0.2616 0.4968 0.0383 0.0518 0.0288 -0.2366 -0.2477 -0.2607 0.1494 0.1610 0.1096 0.0968 0.1086 0.1135 0.0965 0.0929 0.1086 0.1016 0.1040 0.0759 0.0946 0.1011 0.0921 0.0783 0.1023 0.0975 0.0902 0.0909
va: 1.9857 5.4893 2.1604 2.1007 2.1049 2.1640 2.0102 3.4323 3.1384 2.8005 4.1135 3.7269 4.0318 3.8434 4.1821 3.9500 3.9230 4.0921 3.8409 3.8409 3.8442 3.9184 3.9167 3.9674 1.0341 1.0087 1.0014 1.0241 1.0015 0.9916 1.0080 1.0082 0.9968 0.9954 0.9954 1.0107 1.0059 1.0096 1.0022 1.0162 1.0096 1.0068 1.0023 1.0024
dispcorr: -0.020090287 hartree
energy: -1825.725840633583
dipole: -3.36431 2.64530 -0.71900 7.46125 -6.60256 0.85869 0.99246 -0.40673 0.58572
magnitude: 1.26388 au
magnitude: 3.21253 debye
