program: Orca
programVersion: 5.0.2
elementType: S P O O O O O N N N C C C C C C C C C C C C C C H H H H H H H H H H H H H H H H H H H H
charge: 0
multiplicity: 1
keywords: wb97x-d3
keywords: def2-TZVPP
keywords: def2/J RIJCOSX
keywords: DEFGRID2
keywords: scfconv7
keywords: smallprint printgap noloewdin
keywords: NOSOSCF
formula: C14H20N3O5PS
InChI: InChI=1/C14H20N3O5PS/c1-5-19-14(18)11-9-17-12(15-10(11)4)8-13(16-17)22-23(24,20-6-2)21-7-3/h8-9H,5-7H2,1-4H3
44 atoms
S  2.893752 0.700135 2.428448
P  3.218281 0.388772 0.570663
O  2.305762 -0.80171 -0.09336
O  4.650598 -0.116268 0.110913
O  2.95641 1.662802 -0.33182
O  -4.50904 0.579025 -1.888661
O  -5.699029 0.057343 -0.069828
N  -1.044802 -0.462972 -0.215062
N  -2.148797 -1.861858 1.350184
N  0.17329 -0.121575 -0.645494
C  -1.017763 -1.401746 0.801805
C  -3.3712 -0.453028 -0.149539
C  -2.203561 0.000452 -0.698566
C  -3.299027 -1.415581 0.915547
C  0.969614 -0.852981 0.106292
C  0.316175 -1.669963 1.029614
C  -4.514795 -1.97998 1.571311
C  -4.651894 0.07658 -0.673395
C  5.482057 -0.966834 0.934235
C  3.211191 1.695559 -1.760682
C  -5.632987 1.222264 -2.518592
C  4.958492 -2.377671 1.033298
C  2.301203 2.723605 -2.377291
C  -5.818013 2.641743 -2.037911
H  -2.135189 0.725284 -1.496703
H  0.748366 -2.346916 1.746163
H  -5.219489 -2.381027 0.844044
H  -4.220061 -2.77956 2.245903
H  -5.041156 -1.221638 2.150578
H  5.585111 -0.513286 1.921405
H  6.455999 -0.945201 0.4501
H  3.035533 0.713718 -2.202715
H  4.259397 1.955101 -1.909661
H  -5.389668 1.204542 -3.57888
H  -6.534394 0.626566 -2.373248
H  4.025454 -2.435179 1.594447
H  5.694512 -2.983641 1.5620
H  4.80604 -2.820767 0.049677
H  2.461944 3.71283 -1.948986
H  1.25268 2.45319 -2.256161
H  2.511243 2.784566 -3.445042
H  -6.611905 3.108153 -2.621848
H  -6.105437 2.691963 -0.988507
H  -4.911877 3.22998 -2.180784
elementType: S P O N C H
totalener: -1825.70612758 hartree
nucrepener: 2471.79942402 hartree
electener: -4297.50555160 hartree
oneelecener: -7420.54579044 hartree
twoeener: 3123.04023885 hartree
cpcmener: -0.03688674 hartree
kineticenergy: 1819.69543332 hartree
xcener: -138.281860545911 hartree
chargesum: 0.0000000
charge: -0.423940 0.719103 -0.338689 -0.331624 -0.346919 -0.289243 -0.480530 0.194454 -0.350184 -0.402056 0.224443 -0.111564 0.077111 0.193943 0.303206 -0.320208 -0.263016 0.491779 0.027961 0.013758 0.042286 -0.230517 -0.238950 -0.252576 0.161078 0.170916 0.108751 0.095359 0.107191 0.095013 0.111209 0.115711 0.114640 0.110721 0.092480 0.075072 0.101338 0.091964 0.090647 0.080383 0.092000 0.098512 0.089615 0.089371
qa: -0.4239 0.7191 -0.3387 -0.3316 -0.3469 -0.2892 -0.4805 0.1945 -0.3502 -0.4021 0.2244 -0.1116 0.0771 0.1939 0.3032 -0.3202 -0.2630 0.4918 0.0280 0.0138 0.0423 -0.2305 -0.2390 -0.2526 0.1611 0.1709 0.1088 0.0954 0.1072 0.0950 0.1112 0.1157 0.1146 0.1107 0.0925 0.0751 0.1013 0.0920 0.0906 0.0804 0.0920 0.0985 0.0896 0.0894
va: 2.0204 5.5185 2.0750 2.0989 2.1189 2.1343 2.0173 3.3630 3.1273 2.7678 4.0287 3.7412 4.0423 3.8574 4.0772 3.9420 3.9206 4.0950 3.8577 3.8362 3.8346 3.8866 3.9497 3.9242 1.0213 0.9967 1.0017 1.0217 1.0050 1.0085 0.9908 0.9935 0.9968 0.9961 1.0104 1.0152 1.0095 1.0065 1.0029 1.0141 1.0065 1.0061 1.0116 1.0043
dispcorr: -0.020301998 hartree
energy: -1825.726429576152
dipole: -7.05460 7.14659 0.09199 4.41002 -4.46969 -0.05967 -12.64352 9.89856 -2.74496
magnitude: 2.74714 au
magnitude: 6.98269 debye
