program: Orca
programVersion: 5.0.2
elementType: S P O O O O O N N N C C C C C C C C C C C C C C H H H H H H H H H H H H H H H H H H H H
charge: 0
multiplicity: 1
keywords: wb97x-d3
keywords: def2-TZVPP
keywords: def2/J RIJCOSX
keywords: DEFGRID2
keywords: scfconv7
keywords: smallprint printgap noloewdin
keywords: NOSOSCF
formula: C14H20N3O5PS
InChI: InChI=1/C14H20N3O5PS/c1-5-19-14(18)11-9-17-12(15-10(11)4)8-13(16-17)22-23(24,20-6-2)21-7-3/h8-9H,5-7H2,1-4H3
44 atoms
S  4.976777 -0.574456 -0.752596
P  3.17014 -0.045768 -0.403987
O  2.170533 -1.304797 -0.68155
O  2.529531 1.077603 -1.320311
O  2.81759 0.460684 1.060725
O  -4.342178 1.510606 0.529708
O  -5.743611 -0.220582 0.555784
N  -1.121067 -0.706406 -0.169975
N  -2.411467 -2.662786 -0.521136
N  0.139322 -0.256695 -0.192708
C  -1.222713 -2.048597 -0.490859
C  -3.431553 -0.583598 0.09087
C  -2.203191 0.022998 0.113459
C  -3.493474 -1.981437 -0.241798
C  0.830741 -1.323558 -0.530414
C  0.06491 -2.47659 -0.73229
C  -4.774962 -2.744426 -0.303591
C  -4.628761 0.225288 0.411619
C  3.277359 2.228377 -1.775008
C  3.404537 -0.133698 2.243021
C  -5.405243 2.417485 0.876699
C  3.51642 3.233198 -0.676348
C  4.50515 0.74431 2.778327
C  -4.822196 3.805593 0.925829
H  -2.030801 1.062438 0.351005
H  0.39842 -3.461417 -1.010721
H  -4.568167 -3.761904 -0.625283
H  -5.264664 -2.784284 0.668781
H  -5.478724 -2.296687 -1.004211
H  2.665016 2.654355 -2.566991
H  4.216551 1.892633 -2.21847
H  3.772612 -1.138159 2.025597
H  2.587411 -0.228936 2.956477
H  -6.196951 2.353271 0.128482
H  -5.824015 2.133334 1.843636
H  2.584594 3.529746 -0.19522
H  3.965903 4.125403 -1.112935
H  4.202373 2.861192 0.085303
H  4.143368 1.749821 2.993591
H  5.337309 0.812021 2.077924
H  4.881464 0.317553 3.708462
H  -5.610327 4.509843 1.190333
H  -4.036547 3.887791 1.676776
H  -4.416379 4.106981 -0.039917
elementType: S P O N C H
totalener: -1825.70479503 hartree
nucrepener: 2464.82222670 hartree
electener: -4290.52702173 hartree
oneelecener: -7406.30863102 hartree
twoeener: 3115.78160929 hartree
cpcmener: -0.03700538 hartree
kineticenergy: 1819.69674185 hartree
xcener: -138.286252543668 hartree
chargesum: -0.0000000
charge: -0.425205 0.704464 -0.315497 -0.322321 -0.332402 -0.284833 -0.484963 0.174228 -0.353111 -0.407013 0.219818 -0.125524 0.078739 0.201134 0.331168 -0.336704 -0.252857 0.495183 0.022969 0.055599 0.034620 -0.232613 -0.244263 -0.256157 0.161485 0.169151 0.094049 0.105163 0.105699 0.111673 0.093765 0.092692 0.106875 0.098699 0.102102 0.092865 0.100717 0.076702 0.091526 0.078309 0.102008 0.093156 0.089174 0.089729
qa: -0.4252 0.7045 -0.3155 -0.3223 -0.3324 -0.2848 -0.4850 0.1742 -0.3531 -0.4070 0.2198 -0.1255 0.0787 0.2011 0.3312 -0.3367 -0.2529 0.4952 0.0230 0.0556 0.0346 -0.2326 -0.2443 -0.2562 0.1615 0.1692 0.0940 0.1052 0.1057 0.1117 0.0938 0.0927 0.1069 0.0987 0.1021 0.0929 0.1007 0.0767 0.0915 0.0783 0.1020 0.0932 0.0892 0.0897
va: 2.0241 5.5242 2.1818 2.1025 2.0583 2.1327 2.0221 3.4151 3.1270 2.7475 4.0179 3.7661 4.0355 3.8566 4.0604 3.8943 3.9163 4.0817 3.8649 3.8292 3.8422 3.8948 3.9248 3.9697 1.0212 0.9996 1.0225 1.0045 1.0034 0.9912 1.0100 1.0086 0.9975 0.9955 0.9954 1.0056 1.0098 1.0109 1.0028 1.0159 1.0102 1.0065 1.0025 1.0028
dispcorr: -0.019571763 hartree
energy: -1825.724366793070
dipole: -7.01583 6.00823 -1.00760 21.34609 -18.91526 2.43083 10.79944 -9.61582 1.18361
magnitude: 2.88533 au
magnitude: 7.33393 debye
