program: Orca
programVersion: 5.0.2
elementType: S P O O O O O N N N C C C C C C C C C C C C C C H H H H H H H H H H H H H H H H H H H H
charge: 0
multiplicity: 1
keywords: wb97x-d3
keywords: def2-TZVPP
keywords: def2/J RIJCOSX
keywords: DEFGRID2
keywords: scfconv7
keywords: smallprint printgap noloewdin
keywords: NOSOSCF
formula: C14H20N3O5PS
InChI: InChI=1/C14H20N3O5PS/c1-5-19-14(18)11-9-17-12(15-10(11)4)8-13(16-17)22-23(24,20-6-2)21-7-3/h8-9H,5-7H2,1-4H3
44 atoms
S  3.527777 -0.181226 2.513216
P  3.372966 0.073316 0.624658
O  2.020276 0.811836 0.09468
O  3.324886 -1.227246 -0.29206
O  4.470524 1.053994 0.048453
O  -4.8877 1.0458 -1.599284
O  -5.920977 -0.398916 -0.245406
N  -1.273896 0.283001 -0.158085
N  -2.029044 -1.634265 1.011247
N  -0.16626 0.980428 -0.432761
C  -1.033534 -0.824231 0.633156
C  -3.543137 -0.231488 -0.203185
C  -2.50577 0.579642 -0.579651
C  -3.252073 -1.368775 0.626216
C  0.775479 0.306761 0.191819
C  0.324602 -0.829099 0.876472
C  -4.302681 -2.321858 1.09059
C  -4.907568 0.111212 -0.66249
C  4.041936 -2.437386 0.035036
C  4.60387 1.400331 -1.356425
C  -6.13405 1.54649 -2.116789
C  5.532109 -2.283277 -0.134148
C  4.133422 2.811329 -1.59762
C  -6.755622 2.579458 -1.207048
H  -2.601195 1.462652 -1.193776
H  0.879153 -1.538861 1.465756
H  -4.867732 -2.738902 0.257976
H  -3.830238 -3.13734 1.632174
H  -5.015253 -1.835802 1.75598
H  3.645146 -3.183727 -0.650148
H  3.785827 -2.740038 1.051767
H  4.064887 0.689499 -1.983845
H  5.664851 1.29661 -1.576836
H  -5.866067 1.991503 -3.073208
H  -6.816633 0.719211 -2.313576
H  5.96146 -1.59598 0.595551
H  5.786401 -1.935941 -1.135678
H  6.004751 -3.254626 0.013979
H  4.346244 3.080412 -2.63257
H  4.655957 3.52075 -0.956231
H  3.061092 2.918908 -1.439614
H  -7.646754 2.979705 -1.691062
H  -7.058902 2.162051 -0.247905
H  -6.074623 3.410872 -1.026226
elementType: S P O N C H
totalener: -1825.70620210 hartree
nucrepener: 2445.73098018 hartree
electener: -4271.43718228 hartree
oneelecener: -7367.92063288 hartree
twoeener: 3096.48345060 hartree
cpcmener: -0.03716701 hartree
kineticenergy: 1819.69798886 hartree
xcener: -138.286748228826 hartree
chargesum: 0.0000000
charge: -0.421988 0.713350 -0.307736 -0.335737 -0.345538 -0.289404 -0.483951 0.163730 -0.348841 -0.376239 0.166864 -0.127174 0.077728 0.195939 0.296708 -0.274979 -0.259230 0.507458 0.041024 0.042136 0.038694 -0.243899 -0.241910 -0.253055 0.159896 0.148530 0.106945 0.094806 0.105326 0.112704 0.096019 0.104854 0.109727 0.110429 0.092557 0.083045 0.093064 0.105370 0.096820 0.088537 0.080980 0.097559 0.089351 0.089531
qa: -0.4220 0.7133 -0.3077 -0.3357 -0.3455 -0.2894 -0.4840 0.1637 -0.3488 -0.3762 0.1669 -0.1272 0.0777 0.1959 0.2967 -0.2750 -0.2592 0.5075 0.0410 0.0421 0.0387 -0.2439 -0.2419 -0.2531 0.1599 0.1485 0.1069 0.0948 0.1053 0.1127 0.0960 0.1049 0.1097 0.1104 0.0926 0.0830 0.0931 0.1054 0.0968 0.0885 0.0810 0.0976 0.0894 0.0895
va: 2.0211 5.5238 2.1664 2.0548 2.1132 2.1307 2.0169 3.4157 3.1351 2.7935 4.2042 3.7497 4.0415 3.8616 4.1454 3.9790 3.9132 4.0876 3.8336 3.8290 3.8363 3.9125 3.9484 3.9215 1.0257 1.0191 1.0029 1.0219 1.0051 0.9913 1.0101 1.0017 0.9928 0.9959 1.0098 1.0160 1.0048 1.0090 1.0064 1.0043 1.0141 1.0063 1.0124 1.0042
dispcorr: -0.020189245 hartree
energy: -1825.726391345711
dipole: -4.69976 4.54557 -0.15420 1.96333 -1.91482 0.04851 -13.36563 10.42557 -2.94006
magnitude: 2.94450 au
magnitude: 7.48434 debye
