program: Orca
programVersion: 5.0.2
elementType: S P O O O O O N N N C C C C C C C C C C C C C C H H H H H H H H H H H H H H H H H H H H
charge: 0
multiplicity: 1
keywords: wb97x-d3
keywords: def2-TZVPP
keywords: def2/J RIJCOSX
keywords: DEFGRID2
keywords: scfconv7
keywords: smallprint printgap noloewdin
keywords: NOSOSCF
formula: C14H20N3O5PS
InChI: InChI=1/C14H20N3O5PS/c1-5-19-14(18)11-9-17-12(15-10(11)4)8-13(16-17)22-23(24,20-6-2)21-7-3/h8-9H,5-7H2,1-4H3
44 atoms
S  3.291373 0.72523 -1.653558
P  3.347609 0.160383 0.175773
O  1.984944 0.423556 1.033607
O  4.396156 0.854239 1.141075
O  3.574963 -1.381653 0.472657
O  -5.842165 0.057746 -0.634098
O  -5.176166 1.359213 1.05108
N  -1.314495 0.290607 0.458133
N  -1.95604 -1.498236 -0.957988
N  -0.240387 0.857371 1.017803
C  -1.003115 -0.80603 -0.324502
C  -3.573241 0.008293 -0.042213
C  -2.579625 0.690343 0.607245
C  -3.20743 -1.129115 -0.843294
C  0.750718 0.105593 0.589089
C  0.366394 -0.947827 -0.248292
C  -4.19485 -1.976962 -1.575752
C  -4.93841 0.540965 0.189484
C  4.680235 2.273419 1.060341
C  4.434111 -2.204154 -0.350657
C  -7.217729 0.45778 -0.477764
C  5.971079 2.512033 0.323216
C  5.894348 -1.873962 -0.170319
C  -7.910002 -0.318595 0.61669
H  -2.747917 1.551222 1.238161
H  0.972767 -1.700773 -0.721536
H  -4.966618 -2.367256 -0.913494
H  -4.693712 -1.419651 -2.367762
H  -3.673324 -2.816448 -2.02823
H  4.741659 2.616292 2.091601
H  3.852143 2.801472 0.584342
H  4.12985 -2.103758 -1.393905
H  4.221553 -3.222955 -0.033699
H  -7.278078 1.533338 -0.310895
H  -7.668718 0.243458 -1.444363
H  6.191171 3.57994 0.329766
H  5.904045 2.189432 -0.715237
H  6.804199 1.995813 0.799089
H  6.194835 -1.938321 0.87505
H  6.144296 -0.881536 -0.547499
H  6.486895 -2.595208 -0.733697
H  -7.497362 -0.107978 1.602298
H  -8.96373 -0.038807 0.631962
H  -7.854855 -1.392259 0.437029
elementType: S P O N C H
totalener: -1825.70496934 hartree
nucrepener: 2433.96652101 hartree
electener: -4259.67149035 hartree
oneelecener: -7344.84845117 hartree
twoeener: 3085.17696083 hartree
cpcmener: -0.03605261 hartree
kineticenergy: 1819.71037310 hartree
xcener: -138.288222673015 hartree
chargesum: -0.0000000
charge: -0.432421 0.757468 -0.317103 -0.348497 -0.349865 -0.276754 -0.494626 0.157702 -0.348058 -0.358744 0.204160 -0.116918 0.089939 0.186514 0.271212 -0.316546 -0.260558 0.495780 0.052305 0.036834 0.033723 -0.245593 -0.234211 -0.250866 0.150067 0.161996 0.111089 0.108449 0.095418 0.109355 0.091583 0.096507 0.113773 0.096393 0.109733 0.101649 0.078182 0.091577 0.093825 0.075692 0.100536 0.089836 0.099189 0.090274
qa: -0.4324 0.7575 -0.3171 -0.3485 -0.3499 -0.2768 -0.4946 0.1577 -0.3481 -0.3587 0.2042 -0.1169 0.0899 0.1865 0.2712 -0.3165 -0.2606 0.4958 0.0523 0.0368 0.0337 -0.2456 -0.2342 -0.2509 0.1501 0.1620 0.1111 0.1084 0.0954 0.1094 0.0916 0.0965 0.1138 0.0964 0.1097 0.1016 0.0782 0.0916 0.0938 0.0757 0.1005 0.0898 0.0992 0.0903
va: 1.9860 5.4895 2.1577 2.1043 2.1040 2.1587 2.0048 3.4289 3.1365 2.7994 4.1117 3.7249 4.0381 3.8547 4.1872 3.9502 3.9266 4.1030 3.8419 3.8396 3.8321 3.9198 3.9201 3.9227 1.0326 1.0079 1.0011 1.0027 1.0232 0.9966 1.0087 1.0089 0.9914 1.0099 0.9967 1.0094 1.0161 1.0027 1.0058 1.0109 1.0093 1.0129 1.0064 1.0033
dispcorr: -0.020223996 hartree
energy: -1825.725193338981
dipole: -2.49840 1.83860 -0.65980 -4.36112 3.43904 -0.92209 -2.43846 1.93455 -0.50391
magnitude: 1.24077 au
magnitude: 3.15379 debye
