program: Orca
programVersion: 5.0.2
elementType: S P O O O O O N N N C C C C C C C C C C C C C C H H H H H H H H H H H H H H H H H H H H
charge: 0
multiplicity: 1
keywords: wb97x-d3
keywords: def2-TZVPP
keywords: def2/J RIJCOSX
keywords: DEFGRID2
keywords: scfconv7
keywords: smallprint printgap noloewdin
keywords: NOSOSCF
formula: C14H20N3O5PS
InChI: InChI=1/C14H20N3O5PS/c1-5-19-14(18)11-9-17-12(15-10(11)4)8-13(16-17)22-23(24,20-6-2)21-7-3/h8-9H,5-7H2,1-4H3
44 atoms
S  5.187058 0.149547 -0.239435
P  3.332539 0.509108 0.062979
O  2.444485 -0.60801 -0.742512
O  2.764053 1.923119 -0.376937
O  2.782655 0.490752 1.550256
O  -4.35681 1.276909 0.687364
O  -5.516999 -0.621829 0.563298
N  -0.896134 -0.44636 -0.245744
N  -1.966242 -2.438847 -0.954087
N  0.308519 0.129736 -0.160256
C  -0.850421 -1.719808 -0.785019
C  -3.205056 -0.617283 -0.015458
C  -2.051109 0.104429 0.135263
C  -3.116657 -1.932668 -0.589186
C  1.114726 -0.792178 -0.641904
C  0.478608 -1.967966 -1.05276
C  -4.313298 -2.791854 -0.831042
C  -4.480041 -0.014246 0.430892
C  3.197815 2.585801 -1.586148
C  3.26004 -0.448778 2.540061
C  -5.514159 1.989032 1.164006
C  2.734019 1.886534 -2.840115
C  2.832882 -1.868268 2.264046
C  -5.103807 3.416654 1.414652
H  -1.992763 1.098953 0.552355
H  0.918795 -2.855327 -1.474003
H  -4.006288 -3.690635 -1.359715
H  -4.788397 -3.089361 0.103122
H  -5.065088 -2.278501 -1.429279
H  4.284538 2.684199 -1.567441
H  2.767183 3.582022 -1.514997
H  2.834872 -0.092383 3.475705
H  4.345635 -0.370189 2.611033
H  -6.304053 1.935835 0.412863
H  -5.880316 1.521182 2.079353
H  3.233779 0.929984 -2.992673
H  2.972474 2.51745 -3.696555
H  1.656278 1.724782 -2.835121
H  1.753141 -1.949286 2.142482
H  3.117218 -2.484832 3.116749
H  3.320666 -2.287103 1.383755
H  -5.969911 3.973655 1.770755
H  -4.327445 3.485542 2.176592
H  -4.747894 3.901468 0.505733
elementType: S P O N C H
totalener: -1825.70578518 hartree
nucrepener: 2498.55177463 hartree
electener: -4324.25755981 hartree
oneelecener: -7473.60466709 hartree
twoeener: 3149.34710728 hartree
cpcmener: -0.03701176 hartree
kineticenergy: 1819.71210300 hartree
xcener: -138.290068844689 hartree
chargesum: 0.0000000
charge: -0.422956 0.696666 -0.313663 -0.333123 -0.334550 -0.285477 -0.484617 0.176018 -0.352635 -0.385416 0.224103 -0.120061 0.079000 0.200702 0.297238 -0.320733 -0.258734 0.493652 0.025159 0.027104 0.036772 -0.246457 -0.249336 -0.256693 0.160794 0.168534 0.095438 0.106052 0.107320 0.098191 0.113104 0.113232 0.099649 0.100158 0.100398 0.085064 0.107728 0.089660 0.090837 0.110633 0.088895 0.093216 0.089319 0.089815
qa: -0.4230 0.6967 -0.3137 -0.3331 -0.3345 -0.2855 -0.4846 0.1760 -0.3526 -0.3854 0.2241 -0.1201 0.0790 0.2007 0.2972 -0.3207 -0.2587 0.4937 0.0252 0.0271 0.0368 -0.2465 -0.2493 -0.2567 0.1608 0.1685 0.0954 0.1061 0.1073 0.0982 0.1131 0.1132 0.0996 0.1002 0.1004 0.0851 0.1077 0.0897 0.0908 0.1106 0.0889 0.0932 0.0893 0.0898
va: 2.0279 5.5146 2.1013 2.1011 2.1027 2.1330 2.0207 3.4096 3.1282 2.7169 4.0056 3.7570 4.0393 3.8524 4.0459 3.8990 3.9154 4.0800 3.8577 3.8521 3.8411 3.8896 3.8857 3.9703 1.0215 1.0002 1.0219 1.0048 1.0028 1.0093 0.9913 0.9920 1.0091 0.9948 0.9961 1.0164 1.0087 1.0088 1.0050 1.0090 1.0154 1.0064 1.0025 1.0029
dispcorr: -0.020864370 hartree
energy: -1825.726649547059
dipole: -14.85525 13.22069 -1.63457 7.13641 -5.79602 1.34039 3.17172 -2.61371 0.55801
magnitude: 2.18628 au
magnitude: 5.55708 debye
