program: Orca
programVersion: 5.0.2
elementType: S P O O O O O N N N C C C C C C C C C C C C C C H H H H H H H H H H H H H H H H H H H H
charge: 0
multiplicity: 1
keywords: wb97x-d3
keywords: def2-TZVPP
keywords: def2/J RIJCOSX
keywords: DEFGRID2
keywords: scfconv7
keywords: smallprint printgap noloewdin
keywords: NOSOSCF
formula: C14H20N3O5PS
InChI: InChI=1/C14H20N3O5PS/c1-5-19-14(18)11-9-17-12(15-10(11)4)8-13(16-17)22-23(24,20-6-2)21-7-3/h8-9H,5-7H2,1-4H3
44 atoms
S  3.319983 -0.332442 -1.859638
P  3.258552 0.271525 -0.043186
O  2.109628 -0.401477 0.898566
O  2.946189 1.806266 0.215431
O  4.534908 0.014925 0.864948
O  -4.818542 1.398586 0.577897
O  -5.838227 -0.287852 -0.468598
N  -1.200635 -0.224806 0.317149
N  -1.985204 -2.018996 -1.02082
N  -0.085696 0.276322 0.858353
C  -0.980735 -1.38517 -0.404479
C  -3.472386 -0.338118 -0.186425
C  -2.427733 0.29506 0.431763
C  -3.197921 -1.537163 -0.933923
C  0.837383 -0.579121 0.474038
C  0.370782 -1.636912 -0.30802
C  -4.25247 -2.302572 -1.661928
C  -4.831323 0.234836 -0.051734
C  3.468312 2.85573 -0.629576
C  5.352104 -1.171346 0.751418
C  -6.06793 2.067608 0.829992
C  4.952114 3.058247 -0.451526
C  4.660241 -2.407603 1.269684
C  -6.787696 1.501126 2.031133
H  -2.511249 1.197209 1.019209
H  0.928672 -2.452622 -0.733446
H  -5.002686 -2.702124 -0.980426
H  -4.772345 -1.681293 -2.390116
H  -3.788346 -3.133752 -2.186735
H  2.914834 3.744435 -0.333512
H  3.220281 2.633724 -1.669038
H  6.239108 -0.946862 1.340102
H  5.659562 -1.294894 -0.288481
H  -5.783811 3.102974 1.006755
H  -6.69316 2.040427 -0.062884
H  5.25445 3.937487 -1.020736
H  5.532926 2.213741 -0.823156
H  5.211602 3.231197 0.592626
H  4.302805 -2.27039 2.289948
H  5.377287 -3.228909 1.275569
H  3.823056 -2.711213 0.640935
H  -6.157601 1.526961 2.920061
H  -7.668405 2.111912 2.2313
H  -7.124679 0.477779 1.871932
elementType: S P O N C H
totalener: -1825.70519655 hartree
nucrepener: 2455.61670355 hartree
electener: -4281.32190010 hartree
oneelecener: -7388.33959005 hartree
twoeener: 3107.01768994 hartree
cpcmener: -0.03541617 hartree
kineticenergy: 1819.71394865 hartree
xcener: -138.288523016021 hartree
chargesum: -0.0000000
charge: -0.433597 0.748844 -0.336596 -0.350148 -0.345038 -0.289170 -0.483375 0.165541 -0.347891 -0.362245 0.227565 -0.129978 0.081071 0.195657 0.277275 -0.319273 -0.254592 0.507826 0.030092 0.035960 0.040247 -0.238042 -0.234079 -0.254680 0.161197 0.165183 0.105666 0.105749 0.094287 0.111696 0.094944 0.112636 0.095717 0.109680 0.092048 0.099861 0.080903 0.092163 0.091950 0.101407 0.077322 0.088897 0.097732 0.089590
qa: -0.4336 0.7488 -0.3366 -0.3501 -0.3450 -0.2892 -0.4834 0.1655 -0.3479 -0.3622 0.2276 -0.1300 0.0811 0.1957 0.2773 -0.3193 -0.2546 0.5078 0.0301 0.0360 0.0402 -0.2380 -0.2341 -0.2547 0.1612 0.1652 0.1057 0.1057 0.0943 0.1117 0.0949 0.1126 0.0957 0.1097 0.0920 0.0999 0.0809 0.0922 0.0919 0.1014 0.0773 0.0889 0.0977 0.0896
va: 1.9959 5.5046 2.1268 2.1218 2.1021 2.1310 2.0186 3.3964 3.1292 2.8008 4.0490 3.7587 4.0439 3.8611 4.1575 3.9377 3.9139 4.0878 3.8616 3.8448 3.8373 3.8955 3.9039 3.9192 1.0254 1.0028 1.0045 1.0036 1.0221 0.9918 1.0106 0.9917 1.0099 0.9959 1.0097 1.0085 1.0145 1.0063 1.0068 1.0092 1.0110 1.0043 1.0062 1.0130
dispcorr: -0.019922244 hartree
energy: -1825.725118795305
dipole: -3.76422 3.80731 0.04309 5.21375 -3.88642 1.32733 4.85556 -3.95393 0.90163
magnitude: 1.60518 au
magnitude: 4.08004 debye
