program: Orca
programVersion: 5.0.2
elementType: S P O O O O O N N N C C C C C C C C C C C C C C H H H H H H H H H H H H H H H H H H H H
charge: 0
multiplicity: 1
keywords: wb97x-d3
keywords: def2-TZVPP
keywords: def2/J RIJCOSX
keywords: DEFGRID2
keywords: scfconv7
keywords: smallprint printgap noloewdin
keywords: NOSOSCF
formula: C14H20N3O5PS
InChI: InChI=1/C14H20N3O5PS/c1-5-19-14(18)11-9-17-12(15-10(11)4)8-13(16-17)22-23(24,20-6-2)21-7-3/h8-9H,5-7H2,1-4H3
44 atoms
S  2.905155 1.476607 1.297421
P  3.236599 0.00752 0.113691
O  1.970434 -0.419875 -0.824541
O  3.602576 -1.397852 0.75553
O  4.353092 0.164989 -1.000501
O  -5.056608 0.719029 -1.454555
O  -6.012455 -0.396127 0.221146
N  -1.355891 -0.285153 -0.404277
N  -2.072939 -1.129479 1.691685
N  -0.252966 -0.056917 -1.126046
C  -1.088772 -0.852164 0.828368
C  -3.633605 -0.2966 0.078366
C  -2.608083 -0.011657 -0.783098
C  -3.310922 -0.869852 1.357199
C  0.7098 -0.49397 -0.344229
C  0.279669 -1.007519 0.884095
C  -4.342833 -1.183689 2.38897
C  -5.02034 -0.009489 -0.352148
C  4.344106 -1.51385 1.991923
C  4.457837 1.352392 -1.825539
C  -6.343196 1.042388 -2.015444
C  5.796418 -1.146297 1.825446
C  5.500732 2.295485 -1.285131
C  -6.106769 1.870083 -3.25146
H  -2.727216 0.419442 -1.766197
H  0.860196 -1.423902 1.689445
H  -4.956017 -0.314697 2.624614
H  -5.014226 -1.975476 2.058288
H  -3.847493 -1.513453 3.298659
H  4.233383 -2.557343 2.279072
H  3.863572 -0.90022 2.755655
H  3.486673 1.843799 -1.912401
H  4.730604 0.986428 -2.813648
H  -6.877142 0.121485 -2.255976
H  -6.930129 1.596101 -1.280786
H  6.319216 -1.355182 2.759061
H  5.931055 -0.086639 1.605903
H  6.270861 -1.731426 1.038188
H  5.623727 3.123639 -1.983455
H  6.466764 1.802261 -1.178296
H  5.208108 2.708849 -0.320877
H  -5.58629 2.799596 -3.021117
H  -5.534124 1.323873 -4.00082
H  -7.069404 2.128644 -3.691777
elementType: S P O N C H
totalener: -1825.70657003 hartree
nucrepener: 2440.09061944 hartree
electener: -4265.79718947 hartree
oneelecener: -7357.00932140 hartree
twoeener: 3091.21213193 hartree
cpcmener: -0.03559956 hartree
kineticenergy: 1819.70346746 hartree
xcener: -138.285917605034 hartree
chargesum: -0.0000000
charge: -0.431988 0.761415 -0.322697 -0.351472 -0.347658 -0.284297 -0.483415 0.161940 -0.347413 -0.356914 0.221304 -0.113664 0.078528 0.197405 0.262979 -0.332216 -0.258298 0.496734 0.037810 0.046947 0.036112 -0.234699 -0.244039 -0.255807 0.160245 0.168233 0.106888 0.105591 0.095663 0.113839 0.096571 0.094435 0.109857 0.101680 0.099409 0.099705 0.076829 0.093172 0.100597 0.090727 0.077858 0.089684 0.089261 0.093160
qa: -0.4320 0.7614 -0.3227 -0.3515 -0.3477 -0.2843 -0.4834 0.1619 -0.3474 -0.3569 0.2213 -0.1137 0.0785 0.1974 0.2630 -0.3322 -0.2583 0.4967 0.0378 0.0469 0.0361 -0.2347 -0.2440 -0.2558 0.1602 0.1682 0.1069 0.1056 0.0957 0.1138 0.0966 0.0944 0.1099 0.1017 0.0994 0.0997 0.0768 0.0932 0.1006 0.0907 0.0779 0.0897 0.0893 0.0932
va: 1.9854 5.4837 2.1472 2.1039 2.1059 2.1339 2.0226 3.4116 3.1370 2.7920 4.0716 3.7551 4.0436 3.8592 4.1917 3.9458 3.9154 4.0809 3.8379 3.8548 3.8409 3.9207 3.9196 3.9700 1.0234 1.0033 1.0029 1.0047 1.0216 0.9916 1.0089 1.0037 0.9951 0.9959 0.9952 1.0089 1.0130 1.0059 1.0088 1.0031 1.0191 1.0030 1.0026 1.0065
dispcorr: -0.019677188 hartree
energy: -1825.726247221040
dipole: 1.57176 -1.35714 0.21462 6.35009 -5.99166 0.35843 -4.05087 2.96417 -1.08670
magnitude: 1.16423 au
magnitude: 2.95925 debye
