program: Orca
programVersion: 5.0.2
elementType: S P O O O O O N N N C C C C C C C C C C C C C C H H H H H H H H H H H H H H H H H H H H
charge: 0
multiplicity: 1
keywords: wb97x-d3
keywords: def2-TZVPP
keywords: def2/J RIJCOSX
keywords: DEFGRID2
keywords: scfconv7
keywords: smallprint printgap noloewdin
keywords: NOSOSCF
formula: C14H20N3O5PS
InChI: InChI=1/C14H20N3O5PS/c1-5-19-14(18)11-9-17-12(15-10(11)4)8-13(16-17)22-23(24,20-6-2)21-7-3/h8-9H,5-7H2,1-4H3
44 atoms
S  4.764581 1.801584 -0.17297
P  3.414365 0.549611 0.339797
O  1.944494 1.248788 0.364113
O  3.468651 -0.053186 1.806791
O  3.238269 -0.749962 -0.562577
O  -5.057839 1.012163 -0.94859
O  -5.771431 -0.984986 -0.253812
N  -1.280943 0.37679 0.093085
N  -1.787029 -1.717918 1.07863
N  -0.263443 1.21568 -0.130666
C  -0.899079 -0.766926 0.768794
C  -3.47912 -0.390626 0.025127
C  -2.550362 0.570396 -0.276255
C  -3.039715 -1.564002 0.731551
C  0.762049 0.59599 0.41389
C  0.45541 -0.640915 0.993162
C  -3.960554 -2.672127 1.120937
C  -4.882859 -0.177657 -0.395447
C  4.71008 -0.409853 2.456751
C  3.466405 -0.740742 -1.990728
C  -6.360995 1.3601 -1.452455
C  5.359183 -1.628447 1.8506
C  2.378011 -0.023253 -2.749364
C  -6.616068 0.774096 -2.820845
H  -2.759839 1.490475 -0.801377
H  1.09699 -1.337839 1.50308
H  -3.399186 -3.423023 1.670865
H  -4.774573 -2.317714 1.751906
H  -4.407749 -3.14717 0.24863
H  4.430327 -0.590681 3.492371
H  5.381834 0.449949 2.433294
H  3.506138 -1.792255 -2.267055
H  4.444668 -0.300561 -2.191447
H  -7.129738 1.064064 -0.738021
H  -6.348863 2.447337 -1.497503
H  5.735098 -1.441662 0.844423
H  4.672909 -2.474158 1.819159
H  6.211065 -1.912287 2.468929
H  2.361241 1.046382 -2.537867
H  1.394664 -0.441172 -2.533944
H  2.563491 -0.140846 -3.81743
H  -6.656112 -0.314077 -2.808047
H  -7.578435 1.136474 -3.182838
H  -5.854148 1.086965 -3.534545
elementType: S P O N C H
totalener: -1825.70575464 hartree
nucrepener: 2466.61620204 hartree
electener: -4292.32195668 hartree
oneelecener: -7409.63720762 hartree
twoeener: 3117.31525094 hartree
cpcmener: -0.03552864 hartree
kineticenergy: 1819.69401885 hartree
xcener: -138.286948292642 hartree
chargesum: -0.0000000
charge: -0.415586 0.703321 -0.311110 -0.326601 -0.330850 -0.289063 -0.484701 0.167342 -0.348570 -0.357350 0.185433 -0.131220 0.079197 0.196479 0.226221 -0.271611 -0.256222 0.510798 0.020640 0.036069 0.040279 -0.235086 -0.244772 -0.254227 0.160709 0.165991 0.094779 0.105883 0.105213 0.110386 0.097384 0.113017 0.099008 0.091482 0.109615 0.081054 0.093167 0.100991 0.085516 0.090742 0.110699 0.089518 0.097142 0.088897
qa: -0.4156 0.7033 -0.3111 -0.3266 -0.3309 -0.2891 -0.4847 0.1673 -0.3486 -0.3574 0.1854 -0.1312 0.0792 0.1965 0.2262 -0.2716 -0.2562 0.5108 0.0206 0.0361 0.0403 -0.2351 -0.2448 -0.2542 0.1607 0.1660 0.0948 0.1059 0.1052 0.1104 0.0974 0.1130 0.0990 0.0915 0.1096 0.0811 0.0932 0.1010 0.0855 0.0907 0.1107 0.0895 0.0971 0.0889
va: 2.0423 5.5063 2.1387 2.1068 2.0539 2.1312 2.0171 3.4084 3.1360 2.7880 4.1428 3.7575 4.0411 3.8630 4.2155 3.9402 3.9107 4.0862 3.8562 3.8309 3.8376 3.8937 3.8941 3.9200 1.0260 1.0134 1.0221 1.0036 1.0046 0.9918 1.0096 0.9920 1.0116 1.0100 0.9960 1.0151 1.0047 1.0090 1.0170 1.0061 1.0099 1.0129 1.0065 1.0043
dispcorr: -0.020786561 hartree
energy: -1825.726541202393
dipole: -9.61124 8.74352 -0.86772 -10.82024 9.89482 -0.92542 -9.38496 8.62145 -0.76351
magnitude: 1.48063 au
magnitude: 3.76348 debye
