program: Orca
programVersion: 5.0.2
elementType: S P O O O O O N N N C C C C C C C C C C C C C C H H H H H H H H H H H H H H H H H H H H
charge: 0
multiplicity: 1
keywords: wb97x-d3
keywords: def2-TZVPP
keywords: def2/J RIJCOSX
keywords: DEFGRID2
keywords: scfconv7
keywords: smallprint printgap noloewdin
keywords: NOSOSCF
formula: C14H20N3O5PS
InChI: InChI=1/C14H20N3O5PS/c1-5-19-14(18)11-9-17-12(15-10(11)4)8-13(16-17)22-23(24,20-6-2)21-7-3/h8-9H,5-7H2,1-4H3
44 atoms
S  3.095151 1.148801 1.70566
P  3.259038 0.019367 0.168369
O  1.959477 -0.014053 -0.817277
O  3.465969 -1.536297 0.404355
O  4.387144 0.354485 -0.891671
O  -5.067835 1.211222 -1.285461
O  -6.026665 -0.224645 0.130547
N  -1.369474 0.034018 -0.408382
N  -2.105109 -1.19192 1.483107
N  -0.259365 0.391828 -1.063461
C  -1.113413 -0.752102 0.70004
C  -3.652115 -0.076585 0.03516
C  -2.618581 0.37078 -0.743907
C  -3.341001 -0.882025 1.185308
C  0.697825 -0.180908 -0.365871
C  0.254975 -0.912472 0.742403
C  -4.38366 -1.399522 2.119873
C  -5.036938 0.275905 -0.349868
C  4.238578 -2.057133 1.509431
C  4.786522 1.700149 -1.238409
C  -6.341506 1.634768 -1.807097
C  5.71519 -1.786278 1.364198
C  6.285713 1.737627 -1.37035
C  -6.883718 0.680263 -2.844444
H  -2.729463 0.978431 -1.629773
H  0.82394 -1.471897 1.464789
H  -5.035897 -2.122247 1.630473
H  -3.897167 -1.891366 2.958281
H  -5.015015 -0.600033 2.505119
H  4.035055 -3.125752 1.502452
H  3.849487 -1.644665 2.441788
H  4.447235 2.398125 -0.471144
H  4.293659 1.958737 -2.17547
H  -7.04756 1.783915 -0.989726
H  -6.137073 2.606661 -2.251624
H  6.099938 -2.153361 0.413126
H  6.2445 -2.307172 2.162291
H  5.952647 -0.725646 1.454011
H  6.772994 1.49607 -0.425506
H  6.59172 2.742939 -1.659442
H  6.641424 1.047643 -2.135392
H  -7.130258 -0.294822 -2.42659
H  -7.798194 1.102178 -3.262402
H  -6.178486 0.541413 -3.663757
elementType: S P O N C H
totalener: -1825.70654028 hartree
nucrepener: 2431.15923648 hartree
electener: -4256.86577676 hartree
oneelecener: -7339.15285205 hartree
twoeener: 3082.28707529 hartree
cpcmener: -0.03543856 hartree
kineticenergy: 1819.70622624 hartree
xcener: -138.287768030434 hartree
chargesum: 0.0000000
charge: -0.432304 0.753018 -0.318684 -0.348652 -0.341819 -0.289651 -0.483524 0.160627 -0.347664 -0.357722 0.208126 -0.122412 0.075969 0.195623 0.271770 -0.323446 -0.260353 0.505557 0.040963 0.049361 0.039983 -0.236585 -0.239679 -0.254069 0.159420 0.163013 0.106227 0.094348 0.107093 0.113356 0.096147 0.085549 0.110100 0.092404 0.110456 0.093127 0.100613 0.075690 0.086206 0.093512 0.091697 0.089458 0.097719 0.089432
qa: -0.4323 0.7530 -0.3187 -0.3487 -0.3418 -0.2897 -0.4835 0.1606 -0.3477 -0.3577 0.2081 -0.1224 0.0760 0.1956 0.2718 -0.3234 -0.2604 0.5056 0.0410 0.0494 0.0400 -0.2366 -0.2397 -0.2541 0.1594 0.1630 0.1062 0.0943 0.1071 0.1134 0.0961 0.0855 0.1101 0.0924 0.1105 0.0931 0.1006 0.0757 0.0862 0.0935 0.0917 0.0895 0.0977 0.0894
va: 1.9924 5.4950 2.1565 2.0992 2.1198 2.1313 2.0167 3.4170 3.1383 2.7972 4.1059 3.7497 4.0474 3.8603 4.1895 3.9465 3.9130 4.0886 3.8334 3.8203 3.8355 3.9177 3.9386 3.9199 1.0261 1.0075 1.0048 1.0218 1.0029 0.9914 1.0079 1.0149 0.9956 1.0100 0.9960 1.0060 1.0094 1.0139 1.0050 1.0083 1.0034 1.0127 1.0062 1.0042
dispcorr: -0.019625696 hartree
energy: -1825.726165972128
dipole: 1.66973 -1.36761 0.30213 0.05497 0.29783 0.35280 -4.67310 3.64142 -1.03167
magnitude: 1.13141 au
magnitude: 2.87583 debye
