program: Orca
programVersion: 5.0.2
elementType: S P O O O O O N N N C C C C C C C C C C C C C C H H H H H H H H H H H H H H H H H H H H
charge: 0
multiplicity: 1
keywords: wb97x-d3
keywords: def2-TZVPP
keywords: def2/J RIJCOSX
keywords: DEFGRID2
keywords: scfconv7
keywords: smallprint printgap noloewdin
keywords: NOSOSCF
formula: C14H20N3O5PS
InChI: InChI=1/C14H20N3O5PS/c1-5-19-14(18)11-9-17-12(15-10(11)4)8-13(16-17)22-23(24,20-6-2)21-7-3/h8-9H,5-7H2,1-4H3
44 atoms
S  3.21919 1.238085 1.592703
P  3.279325 0.017462 0.117881
O  1.942993 -0.024806 -0.815909
O  3.440039 -1.528644 0.43765
O  4.366837 0.252239 -1.010177
O  -5.102769 0.37094 -1.761236
O  -6.045886 -0.16487 0.188233
N  -1.385889 -0.068295 -0.450685
N  -2.103388 -0.90854 1.645182
N  -0.280707 0.200777 -1.15476
C  -1.116226 -0.589796 0.800535
C  -3.671206 -0.208549 -0.0243
C  -2.641258 0.115358 -0.867943
C  -3.346741 -0.729671 1.276176
C  0.688038 -0.163344 -0.342475
C  0.257582 -0.666895 0.891264
C  -4.381083 -1.104387 2.284924
C  -5.060426 -0.005378 -0.493518
C  4.238565 -2.009987 1.54291
C  4.752929 1.574936 -1.456165
C  -6.380697 0.638621 -2.367155
C  5.716517 -1.815082 1.316277
C  6.023206 2.015966 -0.779523
C  -6.892085 2.019847 -2.033935
H  -2.758711 0.519258 -1.862398
H  0.836289 -1.029882 1.722785
H  -3.887048 -1.497161 3.169904
H  -4.982657 -0.245453 2.580238
H  -5.063257 -1.86341 1.904356
H  3.989613 -3.066471 1.617209
H  3.909375 -1.519235 2.460448
H  3.944038 2.285811 -1.282384
H  4.888796 1.484899 -2.532021
H  -6.193598 0.547225 -3.43535
H  -7.096678 -0.134306 -2.086578
H  6.001324 -0.762199 1.321161
H  6.041618 -2.262915 0.377718
H  6.259945 -2.303268 2.125603
H  6.329781 2.9756 -1.196356
H  6.8318 1.305534 -0.946457
H  5.883044 2.14469 0.292742
H  -7.118375 2.136753 -0.975193
H  -6.177353 2.788992 -2.325528
H  -7.812847 2.195388 -2.590759
elementType: S P O N C H
totalener: -1825.70565570 hartree
nucrepener: 2435.08240356 hartree
electener: -4260.78805925 hartree
oneelecener: -7346.98314336 hartree
twoeener: 3086.19508410 hartree
cpcmener: -0.03493519 hartree
kineticenergy: 1819.71393005 hartree
xcener: -138.290488465189 hartree
chargesum: 0.0000000
charge: -0.430953 0.754325 -0.314050 -0.348942 -0.347013 -0.288602 -0.484966 0.157102 -0.347720 -0.361747 0.189858 -0.129791 0.078118 0.194408 0.286721 -0.306230 -0.256252 0.509522 0.039443 0.050888 0.040305 -0.236773 -0.246864 -0.253579 0.160636 0.154657 0.095224 0.105697 0.105320 0.112932 0.096417 0.093859 0.108678 0.109326 0.091641 0.076644 0.093884 0.100787 0.102005 0.091678 0.078421 0.088935 0.088711 0.097344
qa: -0.4310 0.7543 -0.3140 -0.3489 -0.3470 -0.2886 -0.4850 0.1571 -0.3477 -0.3617 0.1899 -0.1298 0.0781 0.1944 0.2867 -0.3062 -0.2563 0.5095 0.0394 0.0509 0.0403 -0.2368 -0.2469 -0.2536 0.1606 0.1547 0.0952 0.1057 0.1053 0.1129 0.0964 0.0939 0.1087 0.1093 0.0916 0.0766 0.0939 0.1008 0.1020 0.0917 0.0784 0.0889 0.0887 0.0973
va: 1.9870 5.4957 2.1671 2.1000 2.1063 2.1312 2.0170 3.4251 3.1383 2.8024 4.1487 3.7588 4.0437 3.8647 4.1724 3.9634 3.9123 4.0867 3.8424 3.8420 3.8376 3.9175 3.9163 3.9208 1.0261 1.0143 1.0218 1.0043 1.0036 0.9914 1.0080 1.0072 0.9965 0.9960 1.0101 1.0105 1.0061 1.0095 1.0095 1.0026 1.0172 1.0129 1.0044 1.0065
dispcorr: -0.019886077 hartree
energy: -1825.725541772772
dipole: 0.92894 -0.64735 0.28159 3.18685 -3.21793 -0.03108 -1.90581 0.66735 -1.23846
magnitude: 1.27045 au
magnitude: 3.22922 debye
