program: Orca
programVersion: 5.0.2
elementType: S P O O O O O N N N C C C C C C C C C C C C C C H H H H H H H H H H H H H H H H H H H H
charge: 0
multiplicity: 1
keywords: wb97x-d3
keywords: def2-TZVPP
keywords: def2/J RIJCOSX
keywords: DEFGRID2
keywords: scfconv7
keywords: smallprint printgap noloewdin
keywords: NOSOSCF
formula: C14H20N3O5PS
InChI: InChI=1/C14H20N3O5PS/c1-5-19-14(18)11-9-17-12(15-10(11)4)8-13(16-17)22-23(24,20-6-2)21-7-3/h8-9H,5-7H2,1-4H3
44 atoms
S  5.080058 -0.669998 -0.119459
P  3.268151 -0.094539 0.103244
O  2.275184 -1.319899 -0.318755
O  2.809437 1.177482 -0.730006
O  2.746793 0.215631 1.566833
O  -4.248757 1.585678 0.500753
O  -5.698195 -0.066713 0.139769
N  -1.035053 -0.65539 -0.104887
N  -2.325981 -2.590975 -0.557509
N  0.230835 -0.228959 -0.020605
C  -1.133709 -1.997203 -0.43051
C  -3.356446 -0.49623 -0.022676
C  -2.123679 0.089881 0.097786
C  -3.415595 -1.891753 -0.365818
C  0.929156 -1.311122 -0.290935
C  0.161356 -2.449922 -0.557676
C  -4.700247 -2.634845 -0.526274
C  -4.559578 0.333835 0.207881
C  3.312704 1.47804 -2.049893
C  2.790523 1.512455 2.204223
C  -5.318938 2.514654 0.752312
C  2.805328 0.515504 -3.095374
C  4.190386 2.043697 2.386135
C  -4.694798 3.847306 1.07609
H  -1.953565 1.126185 0.349762
H  0.499837 -3.442355 -0.801008
H  -4.483998 -3.667254 -0.788481
H  -5.286168 -2.627762 0.392049
H  -5.320212 -2.201465 -1.31021
H  4.403382 1.491747 -2.021446
H  2.965654 2.489571 -2.249535
H  2.313212 1.351251 3.168499
H  2.172116 2.210023 1.638848
H  -5.955683 2.583975 -0.131308
H  -5.926309 2.154619 1.584369
H  3.126291 0.86627 -4.076389
H  1.71671 0.462345 -3.099766
H  3.207036 -0.489044 -2.960785
H  4.134186 2.96411 2.967493
H  4.671523 2.283202 1.438051
H  4.820409 1.341647 2.931154
H  -4.097674 4.224357 0.245723
H  -5.485198 4.570577 1.273385
H  -4.064549 3.791413 1.963502
elementType: S P O N C H
totalener: -1825.70378779 hartree
nucrepener: 2484.28111428 hartree
electener: -4309.98490206 hartree
oneelecener: -7444.99590776 hartree
twoeener: 3135.01100570 hartree
cpcmener: -0.03719120 hartree
kineticenergy: 1819.69852711 hartree
xcener: -138.288588105866 hartree
chargesum: -0.0000000
charge: -0.426980 0.701941 -0.310110 -0.320811 -0.345884 -0.284545 -0.484516 0.176678 -0.353296 -0.407230 0.216385 -0.131653 0.081225 0.201531 0.326115 -0.331682 -0.250820 0.497867 0.035545 0.049555 0.033568 -0.244394 -0.251812 -0.256795 0.162374 0.169174 0.093835 0.104936 0.105026 0.097553 0.111871 0.110252 0.098305 0.100750 0.100283 0.106781 0.090436 0.083365 0.101475 0.080545 0.091066 0.089430 0.093404 0.089257
qa: -0.4270 0.7019 -0.3101 -0.3208 -0.3459 -0.2845 -0.4845 0.1767 -0.3533 -0.4072 0.2164 -0.1317 0.0812 0.2015 0.3261 -0.3317 -0.2508 0.4979 0.0355 0.0496 0.0336 -0.2444 -0.2518 -0.2568 0.1624 0.1692 0.0938 0.1049 0.1050 0.0976 0.1119 0.1103 0.0983 0.1008 0.1003 0.1068 0.0904 0.0834 0.1015 0.0805 0.0911 0.0894 0.0934 0.0893
va: 2.0352 5.5125 2.1651 2.0518 2.0957 2.1311 2.0237 3.4138 3.1279 2.7406 4.0226 3.7683 4.0312 3.8573 4.0473 3.8951 3.9149 4.0834 3.8401 3.8475 3.8422 3.9009 3.9316 3.9687 1.0205 0.9999 1.0223 1.0041 1.0043 1.0124 0.9907 0.9871 1.0017 0.9953 0.9955 1.0098 1.0076 1.0169 1.0103 1.0103 1.0064 1.0028 1.0066 1.0026
dispcorr: -0.020263946 hartree
energy: -1825.724051734092
dipole: -10.95103 9.37901 -1.57202 20.61363 -17.48604 3.12758 0.33602 -0.26313 0.07289
magnitude: 3.50119 au
magnitude: 8.89932 debye
