program: Orca
programVersion: 5.0.2
elementType: S P O O O O O N N N C C C C C C C C C C C C C C H H H H H H H H H H H H H H H H H H H H
charge: 0
multiplicity: 1
keywords: wb97x-d3
keywords: def2-TZVPP
keywords: def2/J RIJCOSX
keywords: DEFGRID2
keywords: scfconv7
keywords: smallprint printgap noloewdin
keywords: NOSOSCF
formula: C14H20N3O5PS
InChI: InChI=1/C14H20N3O5PS/c1-5-19-14(18)11-9-17-12(15-10(11)4)8-13(16-17)22-23(24,20-6-2)21-7-3/h8-9H,5-7H2,1-4H3
44 atoms
S  3.411064 1.649567 0.976787
P  3.440088 -0.053141 0.100677
O  2.102778 -0.441728 -0.747473
O  3.563232 -1.357299 0.996299
O  4.543013 -0.280445 -1.016784
O  -4.888996 0.581316 -1.725104
O  -5.865082 0.063668 0.214134
N  -1.210981 -0.101326 -0.391328
N  -1.940439 -0.230871 1.860577
N  -0.105958 -0.141757 -1.143348
C  -0.953166 -0.254171 0.958301
C  -3.48702 0.081757 0.059999
C  -2.457695 0.062987 -0.84298
C  -3.17461 -0.072187 1.455067
C  0.850338 -0.329798 -0.25956
C  0.41188 -0.412869 1.067202
C  -4.213472 -0.047712 2.526325
C  -4.868505 0.235338 -0.447961
C  4.502276 -1.431094 2.097931
C  5.080871 0.793789 -1.82138
C  -6.158313 0.677892 -2.397498
C  3.791718 -1.250212 3.413815
C  4.102652 1.282816 -2.859122
C  -6.691675 -0.675256 -2.805272
H  -2.570085 0.163292 -1.912421
H  0.979812 -0.567412 1.968395
H  -3.725324 -0.088813 3.496695
H  -4.82146 0.854929 2.481156
H  -4.889345 -0.89861 2.446784
H  5.29498 -0.690579 1.975282
H  4.958329 -2.416853 2.024311
H  5.966231 0.366894 -2.287899
H  5.40201 1.604646 -1.165695
H  -6.870844 1.220143 -1.775077
H  -5.949489 1.287709 -3.27418
H  3.001064 -1.988883 3.545811
H  3.361264 -0.253099 3.503077
H  4.509266 -1.380048 4.224634
H  3.239986 1.77792 -2.412468
H  3.75181 0.470349 -3.494831
H  4.604893 2.01215 -3.494928
H  -7.596744 -0.531064 -3.396069
H  -5.974759 -1.214868 -3.423968
H  -6.951707 -1.29686 -1.949587
elementType: S P O N C H
totalener: -1825.70613762 hartree
nucrepener: 2452.68558728 hartree
electener: -4278.39172489 hartree
oneelecener: -7382.26542341 hartree
twoeener: 3103.87369852 hartree
cpcmener: -0.03510590 hartree
kineticenergy: 1819.70797648 hartree
xcener: -138.288537499943 hartree
chargesum: 0.0000000
charge: -0.434025 0.761705 -0.314770 -0.349634 -0.351217 -0.290271 -0.483712 0.159996 -0.345981 -0.362397 0.189547 -0.122949 0.077309 0.196532 0.291630 -0.309550 -0.259305 0.504296 0.042216 0.033474 0.040751 -0.249730 -0.237315 -0.253562 0.160160 0.160406 0.094951 0.106265 0.105304 0.095618 0.109309 0.111694 0.096310 0.092285 0.109791 0.090956 0.078832 0.107586 0.077870 0.092241 0.100791 0.097631 0.089356 0.089602
qa: -0.4340 0.7617 -0.3148 -0.3496 -0.3512 -0.2903 -0.4837 0.1600 -0.3460 -0.3624 0.1895 -0.1229 0.0773 0.1965 0.2916 -0.3095 -0.2593 0.5043 0.0422 0.0335 0.0408 -0.2497 -0.2373 -0.2536 0.1602 0.1604 0.0950 0.1063 0.1053 0.0956 0.1093 0.1117 0.0963 0.0923 0.1098 0.0910 0.0788 0.1076 0.0779 0.0922 0.1008 0.0976 0.0894 0.0896
va: 1.9843 5.4835 2.1497 2.1017 2.1216 2.1312 2.0171 3.4201 3.1430 2.7966 4.1607 3.7519 4.0444 3.8587 4.1649 3.9679 3.9164 4.0888 3.8587 3.8498 3.8360 3.9060 3.8929 3.9210 1.0257 1.0050 1.0215 1.0032 1.0052 1.0050 0.9969 0.9928 1.0109 1.0099 0.9960 1.0020 1.0158 1.0094 1.0172 1.0063 1.0085 1.0064 1.0042 1.0125
dispcorr: -0.020058799 hartree
energy: -1825.726196415485
dipole: -7.11446 7.34477 0.23031 -1.68773 1.43345 -0.25428 -2.95461 1.85911 -1.09550
magnitude: 1.14797 au
magnitude: 2.91790 debye
