program: Orca
programVersion: 5.0.2
elementType: S P O O O O O N N N C C C C C C C C C C C C C C H H H H H H H H H H H H H H H H H H H H
charge: 0
multiplicity: 1
keywords: wb97x-d3
keywords: def2-TZVPP
keywords: def2/J RIJCOSX
keywords: DEFGRID2
keywords: scfconv7
keywords: smallprint printgap noloewdin
keywords: NOSOSCF
formula: C14H20N3O5PS
InChI: InChI=1/C14H20N3O5PS/c1-5-19-14(18)11-9-17-12(15-10(11)4)8-13(16-17)22-23(24,20-6-2)21-7-3/h8-9H,5-7H2,1-4H3
44 atoms
S  3.339672 0.547475 2.023997
P  3.34111 -0.021454 0.195605
O  1.994835 0.323065 -0.662978
O  3.447269 -1.576272 -0.103948
O  4.43121 0.60633 -0.769007
O  -5.081217 0.972426 -1.282572
O  -5.978106 -0.435807 0.191225
N  -1.328505 0.074309 -0.330423
N  -2.005012 -1.458484 1.346056
N  -0.237082 0.59653 -0.899253
C  -1.035169 -0.848913 0.656431
C  -3.60535 -0.248427 0.039971
C  -2.592655 0.369747 -0.645725
C  -3.255407 -1.183982 1.074402
C  0.748793 -0.009199 -0.271383
C  0.340296 -0.925344 0.706183
C  -4.270531 -1.89358 1.907418
C  -5.005657 0.068046 -0.320528
C  4.225059 -2.475471 0.716633
C  4.972195 1.934909 -0.58883
C  -6.386269 1.360803 -1.750439
C  5.710348 -2.273163 0.548349
C  3.995254 3.013995 -0.98349
C  -6.193619 2.376824 -2.846516
H  -2.732673 1.090644 -1.437577
H  0.931831 -1.547517 1.355235
H  -3.759446 -2.517219 2.636327
H  -4.913293 -1.193903 2.440477
H  -4.915658 -2.529754 1.302419
H  3.926281 -3.469046 0.390229
H  3.925133 -2.358214 1.759355
H  5.857006 1.957099 -1.221157
H  5.294831 2.052926 0.447017
H  -6.916873 0.482216 -2.121413
H  -6.959311 1.781787 -0.922583
H  6.233927 -3.053451 1.100652
H  6.043662 -1.313445 0.944357
H  6.010183 -2.345386 -0.496832
H  3.135686 3.056769 -0.313971
H  3.639334 2.881233 -2.004787
H  4.500476 3.978419 -0.928413
H  -5.675526 3.265843 -2.486921
H  -5.636822 1.962947 -3.687269
H  -7.170792 2.687369 -3.215521
elementType: S P O N C H
totalener: -1825.70726284 hartree
nucrepener: 2442.86501809 hartree
electener: -4268.57228093 hartree
oneelecener: -7362.53017092 hartree
twoeener: 3093.95788998 hartree
cpcmener: -0.03522929 hartree
kineticenergy: 1819.70385980 hartree
xcener: -138.288506288306 hartree
chargesum: 0.0000000
charge: -0.429228 0.752809 -0.314179 -0.350934 -0.348955 -0.284585 -0.483636 0.157790 -0.346961 -0.363467 0.181123 -0.120822 0.078898 0.198375 0.296516 -0.294713 -0.255233 0.501095 0.038989 0.038872 0.033328 -0.240297 -0.239998 -0.257265 0.160241 0.149504 0.094956 0.105516 0.104568 0.112176 0.095911 0.112829 0.095864 0.101035 0.100907 0.099667 0.080591 0.093248 0.080421 0.091964 0.100634 0.089951 0.089555 0.092937
qa: -0.4292 0.7528 -0.3142 -0.3509 -0.3490 -0.2846 -0.4836 0.1578 -0.3470 -0.3635 0.1811 -0.1208 0.0789 0.1984 0.2965 -0.2947 -0.2552 0.5011 0.0390 0.0389 0.0333 -0.2403 -0.2400 -0.2573 0.1602 0.1495 0.0950 0.1055 0.1046 0.1122 0.0959 0.1128 0.0959 0.1010 0.1009 0.0997 0.0806 0.0932 0.0804 0.0920 0.1006 0.0900 0.0896 0.0929
va: 1.9936 5.4885 2.1616 2.1023 2.1137 2.1326 2.0240 3.4271 3.1398 2.8049 4.1680 3.7610 4.0425 3.8602 4.1553 3.9755 3.9123 4.0824 3.8467 3.8392 3.8417 3.9148 3.9035 3.9690 1.0235 1.0165 1.0216 1.0038 1.0044 0.9913 1.0084 0.9921 1.0105 0.9953 0.9951 1.0085 1.0141 1.0060 1.0156 1.0063 1.0083 1.0026 1.0026 1.0066
dispcorr: -0.019631432 hartree
energy: -1825.726894271466
dipole: -2.06480 2.33105 0.26625 4.55669 -4.13470 0.42200 -6.47292 5.28759 -1.18533
magnitude: 1.28607 au
magnitude: 3.26893 debye
