program: Orca
programVersion: 5.0.2
elementType: S P O O O O O N N N C C C C C C C C C C C C C C H H H H H H H H H H H H H H H H H H H H
charge: 0
multiplicity: 1
keywords: wb97x-d3
keywords: def2-TZVPP
keywords: def2/J RIJCOSX
keywords: DEFGRID2
keywords: scfconv7
keywords: smallprint printgap noloewdin
keywords: NOSOSCF
formula: C14H20N3O5PS
InChI: InChI=1/C14H20N3O5PS/c1-5-19-14(18)11-9-17-12(15-10(11)4)8-13(16-17)22-23(24,20-6-2)21-7-3/h8-9H,5-7H2,1-4H3
44 atoms
S  3.057221 1.829046 1.005053
P  3.341047 0.082064 0.274957
O  2.098109 -0.535746 -0.584372
O  3.58778 -1.120871 1.281185
O  4.513608 -0.099392 -0.776997
O  -4.889864 -0.015442 -1.907666
O  -5.928826 -0.280736 0.04938
N  -1.244362 -0.380177 -0.383913
N  -2.063833 -0.536029 1.834724
N  -0.106469 -0.360489 -1.08649
C  -1.037879 -0.512788 0.977104
C  -3.545771 -0.306493 -0.032655
C  -2.477105 -0.281276 -0.889664
C  -3.285648 -0.436832 1.376059
C  0.818624 -0.492043 -0.160233
C  0.327517 -0.595914 1.146071
C  -4.36638 -0.461442 2.404848
C  -4.910587 -0.200754 -0.597274
C  4.308825 -0.951574 2.522289
C  4.922717 0.9440 -1.689746
C  -6.136286 0.133678 -2.61209
C  5.78141 -0.707839 2.308095
C  3.940385 1.142264 -2.816506
C  -6.665992 1.545484 -2.529352
H  -2.546339 -0.186765 -1.963152
H  0.866105 -0.715369 2.070354
H  -3.915349 -0.523235 3.391905
H  -4.985032 0.434019 2.362305
H  -5.025922 -1.318631 2.274172
H  4.14097 -1.880341 3.063409
H  3.85145 -0.140772 3.092127
H  5.888638 0.613705 -2.065894
H  5.076467 1.868474 -1.130664
H  -5.895357 -0.125548 -3.641176
H  -6.863787 -0.591729 -2.247029
H  6.278986 -0.706559 3.278153
H  5.977086 0.257378 1.83975
H  6.234326 -1.491412 1.701329
H  3.751667 0.21288 -3.353015
H  4.36111 1.857169 -3.523992
H  2.989756 1.547347 -2.469222
H  -6.933312 1.830405 -1.512631
H  -5.942192 2.263719 -2.914128
H  -7.565197 1.619791 -3.141281
elementType: S P O N C H
totalener: -1825.70652369 hartree
nucrepener: 2450.53967547 hartree
electener: -4276.24619916 hartree
oneelecener: -7378.00673661 hartree
twoeener: 3101.76053745 hartree
cpcmener: -0.03495560 hartree
kineticenergy: 1819.71069882 hartree
xcener: -138.289599839442 hartree
chargesum: -0.0000000
charge: -0.430069 0.756739 -0.320436 -0.352906 -0.348748 -0.288218 -0.484434 0.162436 -0.347733 -0.362482 0.211770 -0.132690 0.077665 0.198944 0.277979 -0.323796 -0.256796 0.510873 0.037219 0.037817 0.040399 -0.239255 -0.237225 -0.253683 0.161633 0.163944 0.094368 0.105349 0.105507 0.112984 0.096075 0.112776 0.094982 0.108378 0.091801 0.100110 0.080097 0.093225 0.091753 0.100455 0.078286 0.088572 0.088931 0.097404
qa: -0.4301 0.7567 -0.3204 -0.3529 -0.3487 -0.2882 -0.4844 0.1624 -0.3477 -0.3625 0.2118 -0.1327 0.0777 0.1989 0.2780 -0.3238 -0.2568 0.5109 0.0372 0.0378 0.0404 -0.2393 -0.2372 -0.2537 0.1616 0.1639 0.0944 0.1053 0.1055 0.1130 0.0961 0.1128 0.0950 0.1084 0.0918 0.1001 0.0801 0.0932 0.0918 0.1005 0.0783 0.0886 0.0889 0.0974
va: 1.9931 5.4804 2.1469 2.1048 2.1122 2.1316 2.0176 3.4156 3.1375 2.7912 4.1001 3.7634 4.0436 3.8605 4.1677 3.9589 3.9123 4.0856 3.8421 3.8411 3.8402 3.9157 3.9032 3.9205 1.0252 1.0065 1.0219 1.0040 1.0044 0.9914 1.0087 0.9922 1.0115 0.9960 1.0103 1.0082 1.0148 1.0061 1.0062 1.0088 1.0165 1.0129 1.0041 1.0066
dispcorr: -0.020001076 hartree
energy: -1825.726524767631
dipole: -3.12358 3.42586 0.30228 4.30798 -4.40045 -0.09247 -5.02125 3.95823 -1.06302
magnitude: 1.10903 au
magnitude: 2.81892 debye
