program: Orca
programVersion: 5.0.2
elementType: S P O O O O O N N N C C C C C C C C C C C C C C H H H H H H H H H H H H H H H H H H H H
charge: 0
multiplicity: 1
keywords: wb97x-d3
keywords: def2-TZVPP
keywords: def2/J RIJCOSX
keywords: DEFGRID2
keywords: scfconv7
keywords: smallprint printgap noloewdin
keywords: NOSOSCF
formula: C14H20N3O5PS
InChI: InChI=1/C14H20N3O5PS/c1-5-19-14(18)11-9-17-12(15-10(11)4)8-13(16-17)22-23(24,20-6-2)21-7-3/h8-9H,5-7H2,1-4H3
44 atoms
S  2.570237 1.99284 1.303954
P  3.085504 0.388494 0.393368
O  2.258002 -0.964046 0.796016
O  4.553882 -0.156906 0.65032
O  2.97739 0.331207 -1.185984
O  -4.312581 0.920749 -1.364445
O  -5.682974 -0.680673 -0.6431
N  -1.044968 -0.728378 0.150266
N  -2.256698 -2.503223 1.140907
N  0.193997 -0.246431 0.01161
C  -1.094303 -1.883301 0.912386
C  -3.351705 -0.808578 -0.148692
C  -2.148894 -0.190945 -0.371475
C  -3.360543 -2.01067 0.641536
C  0.926688 -1.096123 0.697342
C  0.207182 -2.140597 1.289102
C  -4.606793 -2.773819 0.948297
C  -4.57509 -0.209119 -0.72855
C  5.309669 0.129709 1.84673
C  3.090299 1.496526 -2.031729
C  -5.402813 1.62829 -1.97923
C  6.282997 1.2539 1.598624
C  1.732444 1.937314 -2.51617
C  -4.833176 2.861609 -2.63058
H  -2.012961 0.712543 -0.948573
H  0.578054 -2.952285 1.891404
H  -5.335812 -2.162324 1.479842
H  -5.090406 -3.137946 0.042106
H  -4.352091 -3.62849 1.571068
H  5.82819 -0.796366 2.093397
H  4.638942 0.365755 2.674958
H  3.727376 1.19441 -2.862896
H  3.599432 2.305205 -1.503011
H  -5.889303 0.985169 -2.715564
H  -6.141117 1.892125 -1.219071
H  6.96175 1.021395 0.777231
H  6.885193 1.412551 2.494385
H  5.767342 2.187945 1.372875
H  1.857988 2.756498 -3.226193
H  1.108425 2.294869 -1.696584
H  1.207719 1.129146 -3.027743
H  -5.642012 3.420558 -3.101677
H  -4.355415 3.518969 -1.903349
H  -4.107463 2.610724 -3.404803
elementType: S P O N C H
totalener: -1825.71288452 hartree
nucrepener: 2471.24878415 hartree
electener: -4296.96166867 hartree
oneelecener: -7419.44552002 hartree
twoeener: 3122.48385135 hartree
cpcmener: -0.02896328 hartree
kineticenergy: 1819.71014441 hartree
xcener: -138.288285543618 hartree
chargesum: 0.0000000
charge: -0.438123 0.759617 -0.314940 -0.344415 -0.333958 -0.282582 -0.457114 0.179215 -0.346040 -0.406990 0.208206 -0.135698 0.078930 0.195995 0.325701 -0.325110 -0.251695 0.478414 0.043922 0.050410 0.033925 -0.234178 -0.239489 -0.255512 0.161774 0.167022 0.104288 0.103963 0.095609 0.106693 0.087213 0.107014 0.085303 0.098917 0.098631 0.089892 0.094266 0.075843 0.101597 0.075285 0.088111 0.092615 0.089116 0.088356
qa: -0.4381 0.7596 -0.3149 -0.3444 -0.3340 -0.2826 -0.4571 0.1792 -0.3460 -0.4070 0.2082 -0.1357 0.0789 0.1960 0.3257 -0.3251 -0.2517 0.4784 0.0439 0.0504 0.0339 -0.2342 -0.2395 -0.2555 0.1618 0.1670 0.1043 0.1040 0.0956 0.1067 0.0872 0.1070 0.0853 0.0989 0.0986 0.0899 0.0943 0.0758 0.1016 0.0753 0.0881 0.0926 0.0891 0.0884
va: 1.9783 5.4863 2.1942 2.1135 2.1057 2.1274 2.0570 3.4117 3.1309 2.7905 4.0282 3.7623 4.0279 3.8628 4.0743 3.8853 3.9172 4.1133 3.8486 3.8524 3.8465 3.9196 3.9073 3.9677 1.0183 1.0001 1.0041 1.0043 1.0219 0.9957 1.0133 0.9964 1.0110 0.9956 0.9954 1.0040 1.0086 1.0194 1.0105 1.0178 1.0060 1.0070 1.0027 1.0028
dispcorr: -0.019572771 hartree
energy: -1825.732457291657
dipole: -3.01083 3.35939 0.34856 13.18783 -12.10132 1.08652 -11.08471 9.82332 -1.26138
magnitude: 1.70091 au
magnitude: 4.32338 debye
