program: Orca
programVersion: 5.0.2
elementType: S P O O O O O N N N C C C C C C C C C C C C C C H H H H H H H H H H H H H H H H H H H H
charge: 0
multiplicity: 1
keywords: wb97x-d3
keywords: def2-TZVPP
keywords: def2/J RIJCOSX
keywords: DEFGRID2
keywords: scfconv7
keywords: smallprint printgap noloewdin
keywords: NOSOSCF
formula: C14H20N3O5PS
InChI: InChI=1/C14H20N3O5PS/c1-5-19-14(18)11-9-17-12(15-10(11)4)8-13(16-17)22-23(24,20-6-2)21-7-3/h8-9H,5-7H2,1-4H3
44 atoms
S  2.661329 1.63535 1.82125
P  3.074678 0.210839 0.609747
O  2.215812 -1.171845 0.793875
O  4.474692 -0.518686 0.759296
O  2.980293 0.517222 -0.946255
O  -4.254134 1.388629 -0.884089
O  -5.67064 -0.325171 -0.68708
N  -1.055581 -0.71269 0.124921
N  -2.339961 -2.619325 0.683933
N  0.198979 -0.251376 0.122764
C  -1.154825 -2.004287 0.613745
C  -3.360384 -0.636052 -0.187714
C  -2.133554 -0.030193 -0.262844
C  -3.419801 -1.987073 0.301627
C  0.890662 -1.252231 0.623074
C  0.128932 -2.378998 0.952684
C  -4.694894 -2.755821 0.417583
C  -4.555712 0.129482 -0.607347
C  5.677404 0.163278 1.166289
C  2.26621 1.632751 -1.519758
C  -5.286558 2.270462 -1.354083
C  6.282733 0.983266 0.054154
C  3.210564 2.75866 -1.853334
C  -5.529712 2.119973 -2.837099
H  -1.958625 0.974197 -0.619706
H  0.461727 -3.313422 1.371191
H  -5.1765 -2.886137 -0.551151
H  -4.477865 -3.738371 0.830343
H  -5.410988 -2.256348 1.069665
H  6.35327 -0.633246 1.47316
H  5.466802 0.779187 2.042951
H  1.480869 1.967653 -0.842832
H  1.787704 1.238275 -2.415518
H  -6.20142 2.11938 -0.779817
H  -4.911305 3.267022 -1.126557
H  5.663043 1.839419 -0.214101
H  6.455623 0.383164 -0.839454
H  7.246398 1.37011 0.387997
H  4.011708 2.43313 -2.517245
H  3.650867 3.19113 -0.954771
H  2.655429 3.547111 -2.363613
H  -5.951244 1.148235 -3.092503
H  -6.23944 2.883414 -3.158206
H  -4.610995 2.262583 -3.406867
elementType: S P O N C H
totalener: -1825.71225540 hartree
nucrepener: 2475.04192712 hartree
electener: -4300.75418252 hartree
oneelecener: -7426.72082886 hartree
twoeener: 3125.96664634 hartree
cpcmener: -0.02823795 hartree
kineticenergy: 1819.72798366 hartree
xcener: -138.294290484878 hartree
chargesum: 0.0000000
charge: -0.436286 0.739675 -0.314193 -0.336593 -0.336570 -0.287945 -0.457350 0.174426 -0.347448 -0.416534 0.207284 -0.141764 0.076929 0.193083 0.340934 -0.326282 -0.250461 0.483224 0.032010 0.069457 0.038598 -0.245700 -0.261917 -0.253476 0.161123 0.166571 0.104195 0.095855 0.104663 0.108783 0.093094 0.088438 0.107892 0.090660 0.107464 0.083774 0.092690 0.100055 0.094420 0.079385 0.103134 0.091243 0.096320 0.087142
qa: -0.4363 0.7397 -0.3142 -0.3366 -0.3366 -0.2879 -0.4574 0.1744 -0.3474 -0.4165 0.2073 -0.1418 0.0769 0.1931 0.3409 -0.3263 -0.2505 0.4832 0.0320 0.0695 0.0386 -0.2457 -0.2619 -0.2535 0.1611 0.1666 0.1042 0.0959 0.1047 0.1088 0.0931 0.0884 0.1079 0.0907 0.1075 0.0838 0.0927 0.1001 0.0944 0.0794 0.1031 0.0912 0.0963 0.0871
va: 1.9876 5.5082 2.1982 2.1253 2.0827 2.1256 2.0498 3.4333 3.1299 2.7998 4.0295 3.7559 4.0265 3.8669 4.0517 3.8857 3.9163 4.1214 3.8586 3.7970 3.8435 3.9024 3.9463 3.9209 1.0226 1.0000 1.0049 1.0222 1.0037 0.9917 1.0122 1.0163 0.9939 1.0105 0.9955 1.0039 1.0058 1.0101 1.0010 1.0096 1.0108 1.0116 1.0068 1.0046
dispcorr: -0.020345036 hartree
energy: -1825.732600439839
dipole: -2.17215 2.26397 0.09182 14.72467 -13.14665 1.57802 -15.58753 13.96539 -1.62214
magnitude: 2.26493 au
magnitude: 5.75700 debye
