program: Orca
programVersion: 5.0.2
elementType: S P O O O O O N N N C C C C C C C C C C C C C C H H H H H H H H H H H H H H H H H H H H
charge: 0
multiplicity: 1
keywords: wb97x-d3
keywords: def2-TZVPP
keywords: def2/J RIJCOSX
keywords: DEFGRID2
keywords: scfconv7
keywords: smallprint printgap noloewdin
keywords: NOSOSCF
formula: C14H20N3O5PS
InChI: InChI=1/C14H20N3O5PS/c1-5-19-14(18)11-9-17-12(15-10(11)4)8-13(16-17)22-23(24,20-6-2)21-7-3/h8-9H,5-7H2,1-4H3
44 atoms
S  2.871009 2.003522 0.895182
P  3.261766 0.20567 0.361742
O  2.25981 -0.935851 0.988085
O  4.645366 -0.421883 0.811249
O  3.263783 -0.157222 -1.179793
O  -5.435897 0.248326 -0.981408
O  -3.876338 1.022891 -2.366422
N  -0.919214 -0.455511 -0.03306
N  -2.463678 -1.638168 1.313596
N  0.388555 -0.22431 -0.180494
C  -1.202681 -1.299935 1.027274
C  -3.193589 -0.25861 -0.500433
C  -1.891813 0.057306 -0.78705
C  -3.446955 -1.151195 0.599482
C  0.931413 -0.917316 0.798597
C  0.015901 -1.616889 1.59249
C  -4.813646 -1.60056 1.005682
C  -4.192037 0.393875 -1.383239
C  5.235434 -0.164467 2.104497
C  3.026569 0.798631 -2.233054
C  -6.478863 0.872748 -1.75216
C  6.422977 0.748921 1.956109
C  4.310733 1.451313 -2.675898
C  -7.788926 0.574275 -1.070776
H  -1.590789 0.714257 -1.591057
H  0.211101 -2.247572 2.442959
H  -4.718816 -2.338356 1.798932
H  -5.415842 -0.772898 1.38063
H  -5.359342 -2.051589 0.177842
H  5.528041 -1.137391 2.496032
H  4.498466 0.260389 2.787929
H  2.297438 1.539987 -1.903797
H  2.576051 0.222616 -3.039966
H  -6.29936 1.948095 -1.80131
H  -6.465997 0.478481 -2.769688
H  7.166446 0.329818 1.278401
H  6.895924 0.885235 2.928784
H  6.126958 1.730077 1.586692
H  4.103425 2.115292 -3.515751
H  5.042548 0.713679 -3.005614
H  4.753211 2.05061 -1.879457
H  -8.595821 1.040327 -1.635918
H  -7.988581 -0.496651 -1.028832
H  -7.818836 0.975849 -0.057878
elementType: S P O N C H
totalener: -1825.71289944 hartree
nucrepener: 2451.47690393 hartree
electener: -4277.18980337 hartree
oneelecener: -7380.00462790 hartree
twoeener: 3102.81482452 hartree
cpcmener: -0.02892893 hartree
kineticenergy: 1819.72102781 hartree
xcener: -138.289857113324 hartree
chargesum: 0.0000000
charge: -0.438620 0.763116 -0.318288 -0.342448 -0.342068 -0.271516 -0.467950 0.177826 -0.347845 -0.411027 0.208158 -0.125802 0.090851 0.191744 0.324790 -0.320100 -0.260772 0.470132 0.043185 0.054426 0.031488 -0.231094 -0.234762 -0.258811 0.151493 0.166500 0.098757 0.106818 0.108143 0.105427 0.087401 0.086717 0.109436 0.099206 0.101003 0.089794 0.093532 0.075630 0.094164 0.089783 0.076052 0.096133 0.089562 0.089835
qa: -0.4386 0.7631 -0.3183 -0.3424 -0.3421 -0.2715 -0.4679 0.1778 -0.3478 -0.4110 0.2082 -0.1258 0.0909 0.1917 0.3248 -0.3201 -0.2608 0.4701 0.0432 0.0544 0.0315 -0.2311 -0.2348 -0.2588 0.1515 0.1665 0.0988 0.1068 0.1081 0.1054 0.0874 0.0867 0.1094 0.0992 0.1010 0.0898 0.0935 0.0756 0.0942 0.0898 0.0761 0.0961 0.0896 0.0898
va: 1.9787 5.4847 2.1773 2.1196 2.1018 2.1564 2.0450 3.4193 3.1317 2.7825 4.0277 3.7273 4.0225 3.8366 4.0702 3.8831 3.9239 4.1190 3.8550 3.8322 3.8482 3.9291 3.9410 3.9657 1.0302 1.0000 1.0242 1.0017 1.0021 0.9966 1.0106 1.0160 0.9925 0.9957 0.9963 1.0040 1.0084 1.0171 1.0083 1.0055 1.0158 1.0072 1.0022 1.0028
dispcorr: -0.019680241 hartree
energy: -1825.732579685640
dipole: -7.87787 6.50066 -1.37721 4.61911 -4.95269 -0.33358 -4.94416 4.75819 -0.18597
magnitude: 1.42918 au
magnitude: 3.63269 debye
